Benzoic acid 1,1-dimethylethyl ester
- Formula: C11H14O2
- Molecular weight: 178.2277
- IUPAC Standard InChIKey: LYDRKKWPKKEMNZ-UHFFFAOYSA-N
- CAS Registry Number: 774-65-2
- Chemical structure:
View 3d structure (requires JavaScript / HTML 5) - Other names: tert-Butyl benzoate; Benzoic acid tert-butyl ester; Trimethylcarbinol benzoate; 1,1-dimethylethyl benzoate

Phase change data

Data compiled by: Robert L. Brown and Stephen E. Stein
Reduced pressure boiling point
Tboil (K) | Pressure (bar) | Reference |
---|---|---|
369. | 0.003 | Buckingham and Donaghy, 1982 |

References

Buckingham and Donaghy, 1982
Buckingham, J.; Donaghy, S.M.,
Dictionary of Organic Compounds: Fifth Edition, Chapman and Hall, New York, 1982, 1. [all data]