1-Naphthaleneethanol
- Formula: C12H12O
- Molecular weight: 172.2231
- IUPAC Standard InChIKey: RXWNCMHRJCOWDK-UHFFFAOYSA-N
- CAS Registry Number: 773-99-9
- Chemical structure:
View 3d structure (requires JavaScript / HTML 5) - Other names: 2-(1-Naphthyl)ethanol; 2-(α-Naphthyl)ethanol; naphthalen-1-ethanol

Phase change data

Data compiled by: Robert L. Brown and Stephen E. Stein
Reduced pressure boiling point
Tboil (K) | Pressure (bar) | Reference |
---|---|---|
459.2 | 0.023 | Aldrich Chemical Company Inc., 1990 |
463. to 468. | 0.027 | Frinton Laboratories Inc., 1986 |

References

Aldrich Chemical Company Inc., 1990
Aldrich Chemical Company Inc.,
Catalog Handbook of Fine Chemicals, Aldrich Chemical Company, Inc., Milwaukee WI, 1990, 1. [all data]
Frinton Laboratories Inc., 1986
Frinton Laboratories Inc.,
Catalog Number 11, Frinton Laboratories Inc., Vineland, NJ, 1986, 99. [all data]