Chloroxine
- Formula: C9H5Cl2NO
- Molecular weight: 214.048
- IUPAC Standard InChIKey: WDFKMLRRRCGAKS-UHFFFAOYSA-N
- CAS Registry Number: 773-76-2
- Chemical structure:
View 3d structure (requires JavaScript / HTML 5) - Other names: 8-Quinolinol, 5,7-dichloro-; Chloroxyquinoline; Chlorquinol; Clofuzid; CHQ; Dichlorohydroxyquinoline; Dichloroquinolinol; Dichloroxin; Dikhloroskin; Endiaron; Quesyl; Quinolor; Quixalin; 5,7-Dichloro-8-Hydroxyquinoline; 5,7-Dichloro-8-oxyquinoline; 5,7-Dichloro-8-quinolinol; 5,7-Dichlorooxine; 5,7-Dichloroxine; Capitrol; 5,7-Dichloro-8-hydroquinoline; Chlofucid; 5,7-Dichlor-8-hydroxychinolin; NSC 3904; 5,7-dichloroquinolin-8-ol

Gas phase thermochemistry data

Data compiled by: Hussein Y. Afeefy, Joel F. Liebman, and Stephen E. Stein
Quantity | Value | Units | Method | Reference | Comment |
---|---|---|---|---|---|
ΔfH°gas | -11.7 ± 0.45 | kcal/mol | Ccr | Ribeiro da Silva, Ferrao, et al., 1995 | HCl(1:600 H2O) |

Condensed phase thermochemistry data

Data compiled by: Hussein Y. Afeefy, Joel F. Liebman, and Stephen E. Stein
Quantity | Value | Units | Method | Reference | Comment |
---|---|---|---|---|---|
ΔfH°solid | -37.79 ± 0.43 | kcal/mol | Ccr | Ribeiro da Silva, Ferrao, et al., 1995 | HCl(1:600 H2O) |
Quantity | Value | Units | Method | Reference | Comment |
ΔcH°solid | -990.75 ± 0.31 | kcal/mol | Ccr | Ribeiro da Silva, Ferrao, et al., 1995 | HCl(1:600 H2O) |

Phase change data

Data compiled as indicated in comments:
AC - William E. Acree, Jr., James S. Chickos
ALS - Hussein Y. Afeefy, Joel F. Liebman, and Stephen E. Stein
Quantity | Value | Units | Method | Reference | Comment |
---|---|---|---|---|---|
ΔsubH° | 26.1 ± 0.2 | kcal/mol | ME | Ribeiro da Silva and Monte, 1992 | Based on data from 351. to 366. K.; AC |
ΔsubH° | 22.2 ± 0.2 | kcal/mol | V | Horton and Wendlandt, 1963 | ALS |
Enthalpy of sublimation
ΔsubH (kcal/mol) | Temperature (K) | Method | Reference | Comment |
---|---|---|---|---|
25.4 ± 0.2 | 358. | ME | Ribeiro da Silva and Monte, 1992 | Based on data from 351. to 366. K.; AC |
22.2 | 363. to 393. | N/A | Horton and Wendlandt, 1963 | AC |

References

Ribeiro da Silva, Ferrao, et al., 1995
Ribeiro da Silva, M.A.V.; Ferrao, M.L.C.C.H.; Alves da Silva, M.R.O.,
Standard enthalpies of combustion of five halogen-substituted 8-hydroxyquinolines by rotating-bomb calorimetry,
J. Chem. Thermodyn., 1995, 27, 633-641. [all data]
Ribeiro da Silva and Monte, 1992
Ribeiro da Silva, M.A.V.; Monte, M.J.S.,
Vapour pressures and enthalpies of sublimation of six halogen-substituted 8-hydroxyquinolines,
J. Chem. Thermodyn., 1992, 24, 715-724. [all data]
Horton and Wendlandt, 1963
Horton, G.R.; Wendlandt, W.W.,
The heats of dissociation of the 8-quinolinol and substituted 8-quinolinol metal chelates of uranium (VI), thorium (IV) and scandium (III),
J. Inorg. Nucl. Chem., 1963, 25, 241-245. [all data]