1,5-Heptadiene, (Z)-
- Formula: C7H12
- Molecular weight: 96.1702
- IUPAC Standard InChIKey: ZGXMNEKDFYUNDQ-XQRVVYSFSA-N
- CAS Registry Number: 7736-34-7
- Chemical structure:
View 3d structure (requires JavaScript / HTML 5) - Stereoisomers:
- Other names: (5Z)-1,5-Heptadiene; 1,cis-5-Heptadiene

Kovats' RI, non-polar column, isothermal

Column type | Active phase | Temperature (C) | I | Reference | Comment |
---|---|---|---|---|---|
Capillary | Squalane | 70. | 688.1 | Soják, Ostrovský, et al., 1980 | N2; Column length: 200. m; Column diameter: 0.25 mm |
Capillary | Squalane | 70. | 684.5 | Soják, Ostrovský, et al., 1980 | N2; Column length: 70. m; Column diameter: 0.25 mm |
Capillary | Squalane | 30. | 683. | Döring, Estel, et al., 1974 | Column length: 150. m; Column diameter: 0.25 mm |

References

Soják, Ostrovský, et al., 1980
Soják, L.; Ostrovský, I.; Leclercq, P.A.; Rijks, J.A.,
Identification of n-hepta- and n-octadienes by high-resolution gas chromatography using structure-retention correlations and mass spectrometry,
J. Chromatogr., 1980, 191, 187-198, https://doi.org/10.1016/S0021-9673(00)86379-7
. [all data]
Döring, Estel, et al., 1974
Döring, C.-E.; Estel, D.; Geyer, R.; Wendt, W.-H.,
Kapillargaschromatographische Analyse geradkettiger C8-Diene,
Z. Chem., 1974, 14, 7, 292-293, https://doi.org/10.1002/zfch.19740140730
. [all data]