13-Hydroxytridecanoic acid
- Formula: C13H26O3
- Molecular weight: 230.3437
- IUPAC Standard InChIKey: DWXOPJCPYKBNEC-UHFFFAOYSA-N
- CAS Registry Number: 7735-38-8
- Chemical structure:
View 3d structure (requires JavaScript / HTML 5) - Permanent link for this species. Use this link for bookmarking this species for future reference.

Condensed phase thermochemistry data

Data compiled by: Hussein Y. Afeefy, Joel F. Liebman, and Stephen E. Stein
Quantity | Value | Units | Method | Reference | Comment |
---|---|---|---|---|---|
ΔfH°solid | -979. ± 3. | kJ/mol | Cm | Wiberg and Waldron, 1991 |

Reaction thermochemistry data

Data compiled by: Hussein Y. Afeefy, Joel F. Liebman, and Stephen E. Stein
Individual Reactions
By formula: C13H26O3 = C13H24O2 + H2O
Quantity | Value | Units | Method | Reference | Comment |
---|---|---|---|---|---|
ΔrH° | 1.0 ± 0.4 | kJ/mol | Cm | Wiberg and Waldron, 1991 | solid phase |

References

Wiberg and Waldron, 1991
Wiberg, K.B.; Waldron, R.F.,
Lactones. 2. Enthalpies of hydrolysis, reduction, and formation of the C4-C13 monocyclic lactones. strain energies and conformations,
J. Am. Chem. Soc., 1991, 113, 7697-7705. [all data]