2-Chloroethyl pentanoate
- Formula: C7H13ClO2
- Molecular weight: 164.630
- IUPAC Standard InChIKey: YTLCJSNLBLLPLD-UHFFFAOYSA-N
- CAS Registry Number: 7735-33-3
- Chemical structure:
View 3d structure (requires JavaScript / HTML 5) - Other names: Pentanoic acid, 2-chloroethyl ester; Ethanol, 2-chloro, pentanoate

Kovats' RI, non-polar column, isothermal

Column type | Active phase | Temperature (C) | I | Reference | Comment |
---|---|---|---|---|---|
Capillary | SE-30 | 140. | 1090. | Korhonen, 1985 | N2; Column length: 25. m; Column diameter: 0.33 mm |
Capillary | SE-30 | 160. | 1086. | Korhonen, 1985 | N2; Column length: 25. m; Column diameter: 0.33 mm |
Capillary | SE-30 | 180. | 1109. | Korhonen, 1985 | N2; Column length: 25. m; Column diameter: 0.33 mm |
Capillary | SE-30 | 200. | 1119. | Korhonen, 1985 | N2; Column length: 25. m; Column diameter: 0.33 mm |
Capillary | OV-101 | 80. | 1089. | Komárek, Hornová, et al., 1982 | N2; Column length: 15. m; Column diameter: 0.22 mm |

Kovats' RI, polar column, isothermal

Column type | Active phase | Temperature (C) | I | Reference | Comment |
---|---|---|---|---|---|
Capillary | OV-351 | 120. | 1569. | Korhonen, 1985 | N2; Column length: 25. m; Column diameter: 0.32 mm |
Capillary | OV-351 | 140. | 1598. | Korhonen, 1985 | N2; Column length: 25. m; Column diameter: 0.32 mm |
Capillary | OV-351 | 160. | 1560. | Korhonen, 1985 | N2; Column length: 25. m; Column diameter: 0.32 mm |
Capillary | OV-351 | 180. | 1603. | Korhonen, 1985 | N2; Column length: 25. m; Column diameter: 0.32 mm |

Van Den Dool and Kratz RI, non-polar column, temperature ramp

Column type | Active phase | I | Reference | Comment |
---|---|---|---|---|
Capillary | SE-30 | 1103. | Korhonen, 1985 | N2, 6. K/min; Column length: 25. m; Column diameter: 0.33 mm; Tstart: 100. C; Tend: 320. C |

Van Den Dool and Kratz RI, polar column, temperature ramp

Column type | Active phase | I | Reference | Comment |
---|---|---|---|---|
Capillary | OV-351 | 1586. | Korhonen, 1985 | N2, 6. K/min; Column length: 25. m; Column diameter: 0.32 mm; Tstart: 100. C; Tend: 230. C |

References

Korhonen, 1985
Korhonen, I.O.O.,
Gas-liquid chromatographic analyses. XLIII. Retention increments for 2-chloro-, 2,2-dichloro- and 2,2,2-trichloroethyl esters of aliphatic C2-C20 n-alkanoic acids on SE-30 and OV-351 capillary columns,
J. Chromatogr., 1985, 329, 43-56, https://doi.org/10.1016/S0021-9673(01)81894-X
. [all data]
Komárek, Hornová, et al., 1982
Komárek, K.; Hornová, L.; Churácek, J.,
Glass capillary gas chromatography of homologous series of esters. II. Separation of homologous series of halogenoethyl esters of aliphatic monocarboxylic acids on OV-101,
J. Chromatogr., 1982, 252, 293-296, https://doi.org/10.1016/S0021-9673(01)88420-X
. [all data]