zinc sulphate
- Formula: O4SZn
- Molecular weight: 161.44
- IUPAC Standard InChIKey: NWONKYPBYAMBJT-UHFFFAOYSA-L
- CAS Registry Number: 7733-02-0
- Chemical structure:
View 3d structure (requires JavaScript / HTML 5) - Other names: Zinc sulfate

Condensed phase thermochemistry data

Quantity | Value | Units | Method | Reference | Comment |
---|---|---|---|---|---|
ΔfH°solid | -980.14 | kJ/mol | Review | Chase, 1998 | Data last reviewed in March, 1979 |
Quantity | Value | Units | Method | Reference | Comment |
S°solid | 110.54 | J/mol*K | Review | Chase, 1998 | Data last reviewed in March, 1979 |
Solid Phase Heat Capacity (Shomate Equation)
Cp° = A + B*t + C*t2 + D*t3 +
E/t2
H° − H°298.15= A*t + B*t2/2 +
C*t3/3 + D*t4/4 − E/t + F − H
S° = A*ln(t) + B*t + C*t2/2 + D*t3/3 −
E/(2*t2) + G
Cp = heat capacity (J/mol*K)
H° = standard enthalpy (kJ/mol)
S° = standard entropy (J/mol*K)
t = temperature (K) / 1000.
View plot Requires a JavaScript / HTML 5 canvas capable browser.
Temperature (K) | 298. to 540. | 540. to 1013. | 1013. to 2000. |
---|---|---|---|
A | 114.4580 | 181.9870 | 145.1850 |
B | -139.5640 | -122.8770 | -0.000112 |
C | 566.6150 | 129.8380 | 0.000058 |
D | -402.5190 | -44.05130 | -0.000010 |
E | -1.201110 | -2.895250 | -0.000017 |
F | -1016.310 | -1038.010 | -1007.190 |
G | 262.2800 | 346.1470 | 294.9870 |
H | -980.1440 | -980.1440 | -980.1440 |
Reference | Chase, 1998 | Chase, 1998 | Chase, 1998 |
Comment | Data last reviewed in March, 1979 | Data last reviewed in March, 1979 | Data last reviewed in March, 1979 |

Reaction thermochemistry data

Data compiled by: José A. Martinho Simões
Individual Reactions
(l) + (
• 100
) (solution) = 2
(g) + (
• 100
) (solution)
By formula: C2H6Zn (l) + (H2O4S • 100H2O) (solution) = 2CH4 (g) + (O4SZn • 100H2O) (solution)
Quantity | Value | Units | Method | Reference | Comment |
---|---|---|---|---|---|
ΔrH° | -341.8 ± 0.8 | kJ/mol | RSC | Carson, Hartley, et al., 1949 | Please also see Pedley and Rylance, 1977 and Cox and Pilcher, 1970. |
(l) + (
• 100
) (solution) = 2
(g) + (
• 100
) (solution)
By formula: C4H10Zn (l) + (H2O4S • 100H2O) (solution) = 2C2H6 (g) + (O4SZn • 100H2O) (solution)
Quantity | Value | Units | Method | Reference | Comment |
---|---|---|---|---|---|
ΔrH° | -354.4 ± 4.2 | kJ/mol | RSC | Carson, Hartley, et al., 1949 | Please also see Pedley and Rylance, 1977 and Cox and Pilcher, 1970. |

References

Chase, 1998
Chase, M.W., Jr.,
NIST-JANAF Themochemical Tables, Fourth Edition,
J. Phys. Chem. Ref. Data, Monograph 9, 1998, 1-1951. [all data]
Carson, Hartley, et al., 1949
Carson, A.S.; Hartley, K.; Skinner, H.A.,
Thermochemistry of metal alkyls. Part II.?The bond dissociation energies of some Zn?C and Cd?C bonds, and of Et?I.,
Trans. Faraday Soc., 1949, 45, 1159, https://doi.org/10.1039/tf9494501159
. [all data]
Pedley and Rylance, 1977
Pedley, J.B.; Rylance, J.,
Computer Analysed Thermochemical Data: Organic and Organometallic Compounds, University of Sussex, Brigton, 1977. [all data]
Cox and Pilcher, 1970
Cox, J.D.; Pilcher, G.,
Thermochemistry of Organic and Organometallic Compounds
in Academic Press, New York, 1970. [all data]