3H-1,4-Benzodiazepine, 2-amino-7-chloro-5-phenyl-, 4-oxide
- Formula: C15H12ClN3O
- Molecular weight: 285.728
- IUPAC Standard InChIKey: LNLMGKOHYYEWMY-UHFFFAOYSA-N
- CAS Registry Number: 7722-15-8
- Chemical structure:
View 3d structure (requires JavaScript / HTML 5) - Other names: 3H-1,4-Benzodiazepin-2-amine, 7-chloro-5-phenyl-, 4-oxide; Demethylchlordiazepoxide; Desmethylchlordiazepoxide; N-Demethylchlordiazepoxide; N-Desmethylchlordiazepoxide; Ro 5-0883

Kovats' RI, non-polar column, isothermal

Column type | Active phase | Temperature (C) | I | Reference | Comment |
---|---|---|---|---|---|
Packed | SE-30 | 250. | 2885. | Schütz, 1982 | N2 |
Packed | SE-30 | 250. | 2885. | Schuetz and Westenberger, 1979 | N2, Chromosorb G AW DMCS (80-100 mesh); Column length: 1.5 m |

Normal alkane RI, non-polar column, custom temperature program

Column type | Active phase | I | Reference | Comment |
---|---|---|---|---|
Other | Methyl Silicone | 2885. | Ardrey and Moffat, 1981 | Program: not specified |
Other | Methyl Silicone | 2930. | Ardrey and Moffat, 1981 | Program: not specified |

References

Schütz, 1982
Schütz, H.,
Benzodiazepines, Springer-Verlag, New York, 1982, 438. [all data]
Schuetz and Westenberger, 1979
Schuetz, H.; Westenberger, V.,
Gas chromatographic data of 31 benzodiazepines and metabolites,
J. Chromatogr., 1979, 169, 409-411, https://doi.org/10.1016/0021-9673(75)85071-0
. [all data]
Ardrey and Moffat, 1981
Ardrey, R.E.; Moffat, A.C.,
Gas-liquid chromatographic retention indices of 1318 substances of toxicological interest on SE-30 or OV-1 stationary phase,
J. Chromatogr., 1981, 220, 3, 195-252, https://doi.org/10.1016/S0021-9673(00)81925-1
. [all data]