tantalum pentachloride
- Formula: Cl5Ta
- Molecular weight: 358.213
- CAS Registry Number: 7721-01-9

Gas phase thermochemistry data

Quantity | Value | Units | Method | Reference | Comment |
---|---|---|---|---|---|
ΔfH°gas | -764.84 | kJ/mol | Review | Chase, 1998 | Data last reviewed in December, 1974 |
Quantity | Value | Units | Method | Reference | Comment |
S°gas,1 bar | 412.94 | J/mol*K | Review | Chase, 1998 | Data last reviewed in December, 1974 |
Gas Phase Heat Capacity (Shomate Equation)
Cp° = A + B*t + C*t2 + D*t3 +
E/t2
H° − H°298.15= A*t + B*t2/2 +
C*t3/3 + D*t4/4 − E/t + F − H
S° = A*ln(t) + B*t + C*t2/2 + D*t3/3 −
E/(2*t2) + G
Cp = heat capacity (J/mol*K)
H° = standard enthalpy (kJ/mol)
S° = standard entropy (J/mol*K)
t = temperature (K) / 1000.
View plot Requires a JavaScript / HTML 5 canvas capable browser.
Temperature (K) | 800. to 6000. |
---|---|
A | 132.0989 |
B | 0.796684 |
C | -0.216099 |
D | 0.018454 |
E | -1.097063 |
F | -807.9346 |
G | 566.4006 |
H | -764.8352 |
Reference | Chase, 1998 |
Comment | Data last reviewed in December, 1974 |

References

Chase, 1998
Chase, M.W., Jr.,
NIST-JANAF Themochemical Tables, Fourth Edition,
J. Phys. Chem. Ref. Data, Monograph 9, 1998, 1-1951. [all data]