Cyclohexene, 1-phenyl-
- Formula: C12H14
- Molecular weight: 158.2396
- IUPAC Standard InChIKey: WCMSFBRREKZZFL-UHFFFAOYSA-N
- CAS Registry Number: 771-98-2
- Chemical structure:
View 3d structure (requires JavaScript / HTML 5) - Species with the same structure:
- Other names: Benzene, 1-cyclohexen-1-yl-; 1-Phenyl-1-cyclohexene; 1-Phenylcyclohexene; Phenyl-1-cyclohexene; phenylcyclohex-1-ene; cyclohexen-1-ylbenzene

Kovats' RI, non-polar column, isothermal

Column type | Active phase | Temperature (C) | I | Reference | Comment |
---|---|---|---|---|---|
Capillary | SE-30 | 130. | 1384. | Bredael, 1982 | Column length: 100. m; Column diameter: 0.5 mm |

Normal alkane RI, non-polar column, custom temperature program

Column type | Active phase | I | Reference | Comment |
---|---|---|---|---|
Capillary | OV-1, SE-30, Methyl silicone, SP-2100, OV-101, DB-1, etc. | 1384. | Waggott and Davies, 1984 | Hydrogen; Column length: 50. m; Column diameter: 0.32 mm; Program: not specified |

Condensed phase thermochemistry data

Data compiled by: Hussein Y. Afeefy, Joel F. Liebman, and Stephen E. Stein

Quantity Value Units Method Reference Comment
Δcliquid-6706.1 ± 6.7kJ/molCcbBrull, 1935Reanalyzed by Cox and Pilcher, 1970, Original value = -6702.64 kJ/mol; Corresponding Δfliquid = -16.8 kJ/mol (simple calculation by NIST; no Washburn corrections)

Phase change data

Data compiled by: Robert L. Brown and Stephen E. Stein

Quantity Value Units Method Reference Comment
Tboil525.2KN/AWeast and Grasselli, 1989

Reduced pressure boiling point

Tboil (K) Pressure (bar) Reference
398.70.019Weast and Grasselli, 1989

References

Bredael, 1982
Bredael, P.,
Retention indices of hydrocarbons on SE-30,
J. Hi. Res. Chromatogr. Chromatogr. Comm., 1982, 5, 6, 325-328, https://doi.org/10.1002/jhrc.1240050610
. [all data]
Waggott and Davies, 1984
Waggott, A.; Davies, I.W.,
Identification of organic pollutants using linear temperature programmed retention indices (LTPRIs) - Part II, 1984, retrieved from http://dwi.defra.gov.uk/research/completed-research/reports/dwi0383.pdf. [all data]