vanadium trichloride
- Formula: Cl3V
- Molecular weight: 157.300
- IUPAC Standard InChIKey: HQYCOEXWFMFWLR-UHFFFAOYSA-K
- CAS Registry Number: 7718-98-1
- Chemical structure:
View 3d structure (requires JavaScript / HTML 5) - Other names: Vanadium(iii) chloride

Gas phase ion energetics data

Data compiled by: John E. Bartmess
Electron affinity determinations
EA (eV) | Method | Reference | Comment |
---|---|---|---|
2.20 ± 0.50 | EIAE | Flesch and Svec, 1975 | From VOCl3 |

References

Flesch and Svec, 1975
Flesch, G.D.; Svec, H.J.,
Thermochemistry of vanadium oxytrichloride and vanadium oxytrifluoride by mass spectrometry,
Inorg. Chem., 1975, 14, 1817. [all data]