1,4-Benzenediol, 2,3,5,6-tetrafluoro-
- Formula: C6H2F4O2
- Molecular weight: 182.0725
- IUPAC Standard InChIKey: ZSDAMBJDFDRLSS-UHFFFAOYSA-N
- CAS Registry Number: 771-63-1
- Chemical structure:

Van Den Dool and Kratz RI, non-polar column, custom temperature program

Column type | Active phase | I | Reference | Comment |
---|---|---|---|---|
Capillary | VF-5MS | 1228.1 | Tret'yakov, 2008 | 30. m/0.25 mm/0.25 μm, He; Program: Multi-step temperature program; T(initial)=60C; T(final)=270C |

References

Tret'yakov, 2008
Tret'yakov, K.V.,
Retention Data. NIST Mass Spectrometry Data Center., NIST Mass Spectrometry Data Center, 2008. [all data]