C9H11F3N2O3

Reaction thermochemistry data

Data compiled by: John E. Bartmess

Individual Reactions

C9H10F3N2O3- + Hydrogen cation = C9H11F3N2O3

By formula: C9H10F3N2O3- + H+ = C9H11F3N2O3

Quantity Value Units Method Reference Comment
Δr318.1 ± 2.1kcal/molG+TSMishima, Matsuoka, et al., 2004gas phase; Calc: enol form of acid more stable.
Quantity Value Units Method Reference Comment
Δr310.0 ± 2.0kcal/molIMREMishima, Matsuoka, et al., 2004gas phase; Calc: enol form of acid more stable.

References

Mishima, Matsuoka, et al., 2004
Mishima, M.; Matsuoka, M.; Lei, Y.X.; Rappoport, Z., Gas-phase acidities of disubstituted methanes and of enols of carboxamides substituted by electron-withdrawing groups, J. Org. Chem., 2004, 69, 18, 5947-5965, https://doi.org/10.1021/jo040196b . [all data]