1,2,3,4-tetrahydro-1-naphthyl hydroperoxide
- Formula: C10H12O2
- Molecular weight: 164.2011
- IUPAC Standard InChIKey: YWBMNCRJFZGXJY-UHFFFAOYSA-N
- CAS Registry Number: 771-29-9
- Chemical structure:
View 3d structure (requires JavaScript / HTML 5) - Species with the same structure:
- Other names: Hydroperoxide, 1,2,3,4-tetrahydro-1-naphthalenyl

Condensed phase thermochemistry data

Data compiled by: Hussein Y. Afeefy, Joel F. Liebman, and Stephen E. Stein
Quantity | Value | Units | Method | Reference | Comment |
---|---|---|---|---|---|
ΔcH°solid | -5520.0 | kJ/mol | Ccb | Hock and Knauel, 1951 | Corresponding ΔfHºsolid = -130. kJ/mol (simple calculation by NIST; no Washburn corrections) |

References

Hock and Knauel, 1951
Hock, I.H.; Knauel, G.,
Autoxydation von kohlenwasserstoffen, XIV. Mitteil. Uber die energetische stellung organischer hydroperoxyde,
Chem. Ber., 1951, 84, 1-5. [all data]