Phencyclidine
- Formula: C17H25N
- Molecular weight: 243.3871
- IUPAC Standard InChIKey: JTJMJGYZQZDUJJ-UHFFFAOYSA-N
- CAS Registry Number: 77-10-1
- Chemical structure:
View 3d structure (requires JavaScript / HTML 5) - Other names: Piperidine, 1-(1-phenylcyclohexyl)-; Cl-395; HOG; 1-(1-Phenylcyclohexyl)piperidine; Phencylidine; Angel dust; CI-395; PCP; PCP (anesthetic); Sernyl; Elysion; Sernylan

Phase change data

Data compiled by: Robert L. Brown and Stephen E. Stein
Reduced pressure boiling point
Tboil (K) | Pressure (atm) | Reference |
---|---|---|
409.2 | 0.001 | Weast and Grasselli, 1989 |

Normal alkane RI, non-polar column, temperature ramp

Data compiled by: NIST Mass Spectrometry Data Center, William E. Wallace, director

Column type CapillaryCapillaryPackedPacked
Active phase DB-5BP-1SE-30SE-30
Column length (m) 15.12.2.2.
Carrier gas HeHeNitrogenN2
Substrate   Chromosorb W AW DMS (80-100 mesh)Chromosorb W AW DMS
Column diameter (mm) 0.250.22
Phase thickness (μm) 0.20.25
Tstart (C) 185.100.130.130.
Tend (C) 270.295.290.290.
Heat rate (K/min) 10.5.8.8.
Initial hold (min)   2.2.
Final hold (min)   8.8.
I 1859.1860.1890.1890.
ReferencePhillips, Logan, et al., 1990Stowell and Wilson, 1985Peel and Perrigo, 1976Peel and Perrigo, 1975
Comment MSDC-RI MSDC-RI MSDC-RI MSDC-RI

References

Weast and Grasselli, 1989
CRC Handbook of Data on Organic Compounds, 2nd Editon, Weast,R.C and Grasselli, J.G., ed(s)., CRC Press, Inc., Boca Raton, FL, 1989, 1. [all data]