Limonene
- Formula: C10H16
- Molecular weight: 136.2340
- IUPAC Standard InChIKey: XMGQYMWWDOXHJM-UHFFFAOYSA-N
- CAS Registry Number: 7705-14-8
- Chemical structure:
View 3d structure (requires JavaScript / HTML 5) - Species with the same structure:
- Stereoisomers:
- Other names: Cyclohexene, 1-methyl-4-(1-methylethenyl)-; p-Mentha-1,8-diene; α-Limonene; Cajeputen; Cajeputene; Cinen; Cinene; Dipenten; Dipentene; Eulimen; Kautschin; Limonen; Nesol; p-Mentha-1,8(9)-diene; δ-1,8-Terpodiene; p-Mentha-1,8-diene, dl-; Acintene DP dipentene; Di-p-mentha-1,8-diene; DL-Limonene; Inactive limonene; 1-Methyl-4-isopropenyl-1-cyclohexene; 1,8(9)-p-Menthadiene; 4-Isopropenyl-1-methyl-1-cyclohexene; Acintene DP; Dipanol; UN 2052; Unitene; 4-Isopropenyl-1-methylcyclohexene; 1,8-p-Menthadiene; 1-Methyl-4-(1-methylethenyl)cyclohexene; 1-Methyl-4-isopropenylcyclohexene; (.+/-.)-Limonene; Achilles dipentene; 1-methyl-4-isopropenylcyclohex-1-ene; 1-methyl-4-(prop-1-en-2-yl)cyclohex-1-ene; Cyclohexene, 1-methyl-4-(1-methylethynyl); Cyclohexene, 1-methyl-4-(1-methylethenyl)-, (.+/-.)-; (.+/-.)-Dipentene; (.+/-.)-α-Limonene; Flavor orange; Goldflush II; NSC 21446; Orange flavor; PC 560; D-Limonene; (+)-limonene; (+)-(4R)-limonene; ( R/ S)-limonene; (R)-(+)-Limonene; (R)-Limonene; (±)-limonene; Limonene [4R-(+), 4S-(-)]; δ-Limonene; 1-Limonene; 1-methyl-4-isopropenylcyclohex-1-ene (limonene); (S)-(-)-Limonene; Limonene+; Dipentene limonene

Condensed phase thermochemistry data

Data compiled by: Hussein Y. Afeefy, Joel F. Liebman, and Stephen E. Stein
Quantity | Value | Units | Method | Reference | Comment |
---|---|---|---|---|---|
ΔcH°liquid | -6171.0 ± 2.1 | kJ/mol | Ccb | Hawkins and Eriksen, 1954 | Reanalyzed by Cox and Pilcher, 1970, Original value = -6170.1 ± 1.0 kJ/mol; Corresponding ΔfHºliquid = -50.75 kJ/mol (simple calculation by NIST; no Washburn corrections) |

Phase change data

Data compiled as indicated in comments:
BS - Robert L. Brown and Stephen E. Stein
TRC - Thermodynamics Research Center, NIST Boulder Laboratories, Chris Muzny director
Quantity | Value | Units | Method | Reference | Comment |
---|---|---|---|---|---|
Tboil | 451.2 | K | N/A | Weast and Grasselli, 1989 | BS |
Tboil | 449.15 | K | N/A | Brame and Hunter, 1927 | Uncertainty assigned by TRC = 1. K; TRC |

Reaction thermochemistry data

Data compiled by: Hussein Y. Afeefy, Joel F. Liebman, and Stephen E. Stein
Individual Reactions
By formula: 2H2 + C10H16 = C10H20
Quantity | Value | Units | Method | Reference | Comment |
---|---|---|---|---|---|
ΔrH° | -215. ± 9.6 | kJ/mol | Chyd | Lopes, Nunes, et al., 1975 | liquid phase; solvent: Acetic acid |
ΔrH° | -224.3 ± 1.3 | kJ/mol | Chyd | Dolliver, Gresham, et al., 1937 | gas phase; Reanalyzed by Cox and Pilcher, 1970, Original value = -226.4 ± 1.3 kJ/mol; At 355 °K |

References

Hawkins and Eriksen, 1954
Hawkins, J.E.; Eriksen, W.T.,
Physical and thermodynamic properties of terpenes. II. The heats of combustion of some terpene hydrocarbons,
J. Am. Chem. Soc., 1954, 76, 2669-26. [all data]
Cox and Pilcher, 1970
Cox, J.D.; Pilcher, G.,
Thermochemistry of Organic and Organometallic Compounds, Academic Press, New York, 1970, 1-636. [all data]
Weast and Grasselli, 1989
CRC Handbook of Data on Organic Compounds, 2nd Editon, Weast,R.C and Grasselli, J.G., ed(s)., CRC Press, Inc., Boca Raton, FL, 1989, 1. [all data]
Brame and Hunter, 1927
Brame, J.S.S.; Hunter, T.G.,
Composition of Cracked Distillates,
J. Inst. Pet. Technol., 1927, 13, 794. [all data]
Lopes, Nunes, et al., 1975
Lopes, M.T.R.; Nunes, M.F.T.; Florencio, M.H.F.S.; Mota, M.M.G.; Fernandez, M.T.N.,
Heats of hydrogenation in solution. I. Calorimeter for semimicro determinations,
Rev. Port. Quim., 1975, 15, 129-132. [all data]
Dolliver, Gresham, et al., 1937
Dolliver, M.a.; Gresham, T.L.; Kistiakowsky, G.B.; Vaughan, W.E.,
Heats of organic reactions. V. Heats of hydrogenation of various hydrocarbons,
J. Am. Chem. Soc., 1937, 59, 831-841. [all data]