Fentin hydroxide
- Formula: C18H16OSn
- Molecular weight: 367.029
- IUPAC Standard InChIKey: BFWMWWXRWVJXSE-UHFFFAOYSA-M
- CAS Registry Number: 76-87-9
- Chemical structure:
- Other names: Stannane, hydroxytriphenyl-; Dowco 186; Du-Ter; Du-Ter W-50; Duter extra; Erithane; ENT 28009; Fenolovo; Hydroxytriphenylstannane; Hydroxytriphenyltin; K 19; Stannol, Triphenyl-; Tenhide; Tin, hydroxytriphenyl-; Triphenylstannanol; Triphenyltin hydroxide; TPTH; Fintin hydroxid; Fintin hydroxyde; Fintin idrossido; Fintine hydroxyde; Hydroxyde de triphenyl-etain; Idrossido di stagno trifenile; NCI-C00260; Suzu H; Tptoh; Trifenyl-tinhydroxyde; Triphenyl-zinnhydroxid; Tubotin; Vancide KS; Flo-Tin 4L; Haitin; OMS 1017; Phenostat-H; Trifenylstanniumhydroxid; Triphenylstannium hydroxide; Ashlade flotin; Farmatin; Super-tin; Sunitron H; NSC 113243

Phase change data

Data compiled as indicated in comments:
TRC - Thermodynamics Research Center, NIST Boulder Laboratories, Chris Muzny director
MS - José A. Martinho Simões
Quantity | Value | Units | Method | Reference | Comment |
---|---|---|---|---|---|
Tfus | 390.88 | K | N/A | Donnelly, Drewes, et al., 1990 | Uncertainty assigned by TRC = 0.2 K; TRC |
Quantity | Value | Units | Method | Reference | Comment |
ΔsubH° | 129.7 ± 4.2 | kJ/mol | CC-SB | Carson, Franklin, et al., 1975 | MS |

Gas phase thermochemistry data

Data compiled by: José A. Martinho Simões
Quantity | Value | Units | Method | Reference | Comment |
---|---|---|---|---|---|
ΔfH°gas | 43.4 ± 2.2 | kcal/mol | Review | Martinho Simões |

Condensed phase thermochemistry data

Data compiled by: José A. Martinho Simões
Quantity | Value | Units | Method | Reference | Comment |
---|---|---|---|---|---|
ΔfH°solid | 12.4 ± 2.0 | kcal/mol | Review | Martinho Simões | |
Quantity | Value | Units | Method | Reference | Comment |
ΔcH°solid | -2389.9 ± 1.9 | kcal/mol | CC-SB | Carson, Franklin, et al., 1975 |

Normal alkane RI, non-polar column, custom temperature program

Column type | Active phase | I | Reference | Comment |
---|---|---|---|---|
Packed | OV-1 | 2682. | Janos and Oros, 1990 | Nitrogen, Chromosorb G (80-100 mesh); Column length: 1.2 m; Program: not specified |

Normal alkane RI, polar column, custom temperature program

Column type | Active phase | I | Reference | Comment |
---|---|---|---|---|
Packed | Carbowax 20M | 3679. | Janos and Oros, 1990 | Nitrogen, Chromosorb G (80-100 mesh); Column length: 1.2 m; Program: not specified |

References

Donnelly, Drewes, et al., 1990
Donnelly, J.R.; Drewes, L.A.; Johnson, R.L.; Munslow, W.D.; Knapp, K.K.; Sovocool, G.W.,
Purity and heat of fusion data for environmental standards as determined by differential scanning calorimetry,
Thermochim. Acta, 1990, 167, 2, 155, https://doi.org/10.1016/0040-6031(90)80476-F
. [all data]
Carson, Franklin, et al., 1975
Carson, A.S.; Franklin, J.; Laye, P.G.; Morris, H.,
J. Chem. Thermodyn., 1975, 7, 763. [all data]