Triphenylmethyl chloride
- Formula: C19H15Cl
- Molecular weight: 278.775
- IUPAC Standard InChIKey: JBWKIWSBJXDJDT-UHFFFAOYSA-N
- CAS Registry Number: 76-83-5
- Chemical structure:
View 3d structure (requires JavaScript / HTML 5) - Other names: Trityl chloride; Triphenylchloromethane; Chlorotriphenylmethane; Benzene, 1,1',1''-(chloromethylidyne)tris-; Methane, chlorotriphenyl-

Condensed phase thermochemistry data

Data compiled as indicated in comments:
ALS - Hussein Y. Afeefy, Joel F. Liebman, and Stephen E. Stein
DH - Eugene S. Domalski and Elizabeth D. Hearing
Quantity | Value | Units | Method | Reference | Comment |
---|---|---|---|---|---|
ΔfH°solid | 183. | kJ/mol | Ccb | Schmidlin, 1906 | ALS |
Quantity | Value | Units | Method | Reference | Comment |
ΔcH°solid | -9826.1 | kJ/mol | Ccb | Schmidlin, 1906 | ALS |
Constant pressure heat capacity of solid
Cp,solid (J/mol*K) | Temperature (K) | Reference | Comment |
---|---|---|---|
367.27 | 298.15 | Naoki, Seki, et al., 1991 | T = 232 to 411 K. Cp value calculated from equation. Cp(c) = -3980 + 55.15T - 0.2726T2 + 6.07x10-4T3 - 5.0x10-7T4 J/mol*K (232.8 to 359.0 K).; DH |
311.7 | 298.5 | Smith and Andrews, 1931 | T = 102 to 346 K. Value is unsmoothed experimental datum.; DH |

Phase change data

Data compiled as indicated in comments:
BS - Robert L. Brown and Stephen E. Stein
TRC - Thermodynamics Research Center, NIST Boulder Laboratories, Chris Muzny director
DH - Eugene S. Domalski and Elizabeth D. Hearing
AC - William E. Acree, Jr., James S. Chickos
Quantity | Value | Units | Method | Reference | Comment |
---|---|---|---|---|---|
Tfus | 381. | K | N/A | Smith and Andrews, 1931, 2 | Uncertainty assigned by TRC = 4. K; m.p. by Hg thermometer; TRC |
Tfus | 382.4 | K | N/A | Smith and Andrews, 1931, 2 | Uncertainty assigned by TRC = 0.5 K; m.p. b thermocouple; TRC |
Reduced pressure boiling point
Tboil (K) | Pressure (bar) | Reference | Comment |
---|---|---|---|
505.7 | 0.027 | Weast and Grasselli, 1989 | BS |
Enthalpy of fusion
ΔfusH (kJ/mol) | Temperature (K) | Reference | Comment |
---|---|---|---|
27.900 | 376.8 | Naoki, Seki, et al., 1991 | DH |
27.9 | 376.8 | Domalski and Hearing, 1996 | AC |
Entropy of fusion
ΔfusS (J/mol*K) | Temperature (K) | Reference | Comment |
---|---|---|---|
74.1 | 376.8 | Naoki, Seki, et al., 1991 | DH |
Temperature of phase transition
Ttrs (K) | Initial Phase | Final Phase | Reference | Comment |
---|---|---|---|---|
250. | crystaline | glass | Naoki, Seki, et al., 1991 | DH |

References

Schmidlin, 1906
Schmidlin, M.J.,
Recherches chimiques et thermochimiques sur la constitution des rosanilines,
Ann. Chim. Phys., 1906, 1, 195-256. [all data]
Naoki, Seki, et al., 1991
Naoki, M.; Seki, M.; Kugo, H.; Saito, F.; Taioka, T.,
Dielectric relaxation in supercooled triphenylchloromethane and intrinsic factor determining mobility in molecular liquids,
J. Phys. Chem., 1991, 95(14), 5628-5633. [all data]
Smith and Andrews, 1931
Smith, R.H.; Andrews, D.H.,
Thermal energy studies. I. Phenyl derivatives of methane,
ethane and some related compounds. J. Am. Chem. Soc., 1931, 53, 3644-3660. [all data]
Smith and Andrews, 1931, 2
Smith, R.H.; Andrews, D.H.,
Thermal Energy Studies I. Phenyl Derivatives of Methane, Ethane and Some Related Compounds,
J. Am. Chem. Soc., 1931, 53, 3644. [all data]
Weast and Grasselli, 1989
CRC Handbook of Data on Organic Compounds, 2nd Editon, Weast,R.C and Grasselli, J.G., ed(s)., CRC Press, Inc., Boca Raton, FL, 1989, 1. [all data]
Domalski and Hearing, 1996
Domalski, Eugene S.; Hearing, Elizabeth D.,
Heat Capacities and Entropies of Organic Compounds in the Condensed Phase. Volume III,
J. Phys. Chem. Ref. Data, 1996, 25, 1, 1, https://doi.org/10.1063/1.555985
. [all data]
Evans, McEwan, et al., 1957
Evans, A.G.; McEwan, I.H.; Thomas, J.H.,
The effect of solvents on the ionisation of organic halides. Part V. Ionisation in mixed solvents,
J. Chem. Soc., 1957, 4644-4649. [all data]