Benzene, (1-methyl-1-propenyl)-, (E)-
- Formula: C10H12
- Molecular weight: 132.2023
- IUPAC Standard InChIKey: UGUYQBMBIJFNRM-YCRREMRBSA-N
- CAS Registry Number: 768-00-3
- Chemical structure:
View 3d structure (requires JavaScript / HTML 5) - Stereoisomers:
- Other names: 2-Butene, 2-phenyl-, (E)-; (E)-2-Phenyl-2-butene; trans-2-Phenyl-2-butene; 2-Butene, 2-phenyl-, trans; (E)-(1-Methylpropenyl)benzene; (E)-(1-Methyl-1-propenyl)benzene; Benzene, ((1E)-1-methyl-1-propenyl)-

Condensed phase thermochemistry data

Data compiled by: Hussein Y. Afeefy, Joel F. Liebman, and Stephen E. Stein
Quantity | Value | Units | Method | Reference | Comment |
---|---|---|---|---|---|
ΔcH°liquid | -5746.3 | kJ/mol | Ccb | Lemoult, 1911 | Corresponding ΔfHºliquid = 96.2 kJ/mol (simple calculation by NIST; no Washburn corrections) |

Phase change data

Data compiled as indicated in comments:
BS - Robert L. Brown and Stephen E. Stein
TRC - Thermodynamics Research Center, NIST Boulder Laboratories, Chris Muzny director
Quantity | Value | Units | Method | Reference | Comment |
---|---|---|---|---|---|
Tboil | 468. ± 2. | K | AVG | N/A | Average of 6 values; Individual data points |
Quantity | Value | Units | Method | Reference | Comment |
Tfus | 249.7 | K | N/A | Anonymous, 1952 | Uncertainty assigned by TRC = 0.3 K; TRC |
Tfus | 249.65 | K | N/A | Greenlee and Waalkes, 1945 | Uncertainty assigned by TRC = 0.3 K; TRC |
Reduced pressure boiling point
Tboil (K) | Pressure (bar) | Reference | Comment |
---|---|---|---|
367.2 | 0.040 | Weast and Grasselli, 1989 | BS |

References

Lemoult, 1911
Lemoult, M.P.,
Thermochimie. - Recherches sur les derives du styrolene; rectification de quelques erreurs experimentales,
Compt. Rend., 1911, 152, 1402-1404. [all data]
Anonymous, 1952
Anonymous, R.,
, Physical Properties of Chemical Substances, Dow Chemical Co., 1952. [all data]
Greenlee and Waalkes, 1945
Greenlee, K.W.; Waalkes, T.P.,
, Am. Pet. Inst. Res. Proj. 45 No. 123A, Ohio State Univ., 1945. [all data]
Weast and Grasselli, 1989
CRC Handbook of Data on Organic Compounds, 2nd Editon, Weast,R.C and Grasselli, J.G., ed(s)., CRC Press, Inc., Boca Raton, FL, 1989, 1. [all data]