Benzene, (1-methyl-1-propenyl)-, (Z)-
- Formula: C10H12
- Molecular weight: 132.2023
- IUPAC Standard InChIKey: UGUYQBMBIJFNRM-OQFOIZHKSA-N
- CAS Registry Number: 767-99-7
- Chemical structure:
View 3d structure (requires JavaScript / HTML 5) - Stereoisomers:
- Other names: 2-Butene, 2-phenyl-, (Z)-; (Z)-2-Phenyl-2-butene; trans-α,β-Dimethylstilbene; trans-2-Phenyl-2-butene; 2-Butene, 2-phenyl-, trans; trans-α,β-Dimethylstyrene; 2-phenyl-2-butene

Phase change data

Data compiled by: Thermodynamics Research Center, NIST Boulder Laboratories, Chris Muzny director
Quantity | Value | Units | Method | Reference | Comment |
---|---|---|---|---|---|
Tboil | 446.15 | K | N/A | Cram, 1952 | Uncertainty assigned by TRC = 2. K |
Tboil | 447. | K | N/A | Cram, 1949 | Uncertainty assigned by TRC = 2.5 K; identified as trans- isomer in original |

References

Cram, 1952
Cram, D.J.,
Studies in Stereochemistry VI. The Mechanisms of the E1 and Hydrogen Migration Reactions in the 3-Phenyl-2-butanol System,
J. Am. Chem. Soc., 1952, 74, 2137. [all data]
Cram, 1949
Cram, D.J.,
Studies in Stereochemistry IV. The Chugaev Reaction in the Determin- ation of Configuration of Certain Alcohols,
J. Am. Chem. Soc., 1949, 71, 3883. [all data]