Quinoline, decahydro-, trans-
- Formula: C9H17N
- Molecular weight: 139.2380
- IUPAC Standard InChIKey: POTIYWUALSJREP-DTWKUNHWSA-N
- CAS Registry Number: 767-92-0
- Chemical structure:
View 3d structure (requires JavaScript / HTML 5) - Stereoisomers:
- Other names: trans-Decahydroquinoline; Decahydroquinoline, (E)-

Gas phase thermochemistry data

Data compiled by: Hussein Y. Afeefy, Joel F. Liebman, and Stephen E. Stein
Quantity | Value | Units | Method | Reference | Comment |
---|---|---|---|---|---|
ΔfH°gas | -112.9 ± 1.0 | kJ/mol | Ccr | Steele, Chirico, et al., 1994 | see Steele, Chirico, et al., 1990 |

Condensed phase thermochemistry data

Data compiled by: Hussein Y. Afeefy, Joel F. Liebman, and Stephen E. Stein
Quantity | Value | Units | Method | Reference | Comment |
---|---|---|---|---|---|
ΔfH°solid | -190.8 ± 1.4 | kJ/mol | Ccr | Steele, Chirico, et al., 1994 | see Steele, Chirico, et al., 1990 |
Quantity | Value | Units | Method | Reference | Comment |
ΔcH°solid | -5780.3 ± 1.3 | kJ/mol | Ccr | Steele, Chirico, et al., 1994 | see Steele, Chirico, et al., 1990 |

Phase change data

Data compiled as indicated in comments:
TRC - Thermodynamics Research Center, NIST Boulder Laboratories, Chris Muzny director
AC - William E. Acree, Jr., James S. Chickos
DRB - Donald R. Burgess, Jr.
Quantity | Value | Units | Method | Reference | Comment |
---|---|---|---|---|---|
Ttriple | 321.300 | K | N/A | Steele, Chirico, et al., 1994, 2 | Uncertainty assigned by TRC = 0.005 K; TRC |
Quantity | Value | Units | Method | Reference | Comment |
ΔsubH° | 77.9 | kJ/mol | N/A | Steele, Chirico, et al., 1994 | DRB |
Enthalpy of vaporization
ΔvapH (kJ/mol) | Temperature (K) | Method | Reference | Comment |
---|---|---|---|---|
50.4 | 340. | EB,IP | Steele, Chirico, et al., 1994 | Based on data from 325. to 525. K.; AC |
47.6 | 380. | EB,IP | Steele, Chirico, et al., 1994 | Based on data from 325. to 525. K.; AC |
45.0 | 420. | EB,IP | Steele, Chirico, et al., 1994 | Based on data from 325. to 525. K.; AC |
42.3 | 460. | EB,IP | Steele, Chirico, et al., 1994 | Based on data from 325. to 525. K.; AC |
39.5 | 500. | EB,IP | Steele, Chirico, et al., 1994 | Based on data from 325. to 525. K.; AC |
Enthalpy of fusion
ΔfusH (kJ/mol) | Temperature (K) | Reference | Comment |
---|---|---|---|
25.72 | 321.4 | Steele, Chirico, et al., 1994 | AC |

Kovats' RI, non-polar column, isothermal

Column type | Active phase | Temperature (C) | I | Reference | Comment |
---|---|---|---|---|---|
Packed | OV-101 | 120. | 1142. | Litvinenko, Isakova, et al., 1988 | He, Chromaton W AW; Column length: 2.4 m |

References

Steele, Chirico, et al., 1994
Steele, W.V.; Chirico, R.D.; Nguyen, A.; Knipmeyer, S.E.,
The thermodynamic properties of 2-methylaniline and trans-(r,S)-decahydroquinoline,
J. Chem. Thermodyn., 1994, 26, 515-544. [all data]
Steele, Chirico, et al., 1990
Steele, W.V.; Chirico, R.D.; Nguyen, A.; Knipmeyer, S.E.,
The thermodynamic properties of 2-methylaniline and trans-(R,S)-decahydroquinoline,
Topical Rept., work performed under cooperative agreement No. FC22-83FE60149, Bartlesville,OK, (NIPER-459), 1990, 1-52. [all data]
Steele, Chirico, et al., 1994, 2
Steele, W.V.; Chirico, R.D.; Nguyen, A.; Knipmeyer, S.E.,
The thermodynamic properties of 2-methylaniline and trans-(R,S)-decahydroquinoline,
J. Chem. Thermodyn., 1994, 26, 5, 515, https://doi.org/10.1006/jcht.1994.1061
. [all data]
Litvinenko, Isakova, et al., 1988
Litvinenko, G.S.; Isakova, L.A.; Rubanyk, N.N.,
Quantitative correlation between structure of stereoisomeric saturated cyclic compounds and gas-chromatographic retention indices. I. Methysubstituted,
Izv. AN Kaz. SSR, Ser. Khim., 1988, 5, 54-66. [all data]