Secobarbital
- Formula: C12H18N2O3
- Molecular weight: 238.2829
- IUPAC Standard InChIKey: KQPKPCNLIDLUMF-UHFFFAOYSA-N
- CAS Registry Number: 76-73-3
- Chemical structure:
View 3d structure (requires JavaScript / HTML 5) - Other names: 2,4,6(1H,3H,5H)-Pyrimidinetrione, 5-(1-methylbutyl)-5-(2-propenyl)-; Barbituric acid, 5-allyl-5-(1-methylbutyl)-; 5-Allyl-5-(1-methylbutyl)barbituric acid; 5-Allyl-5-(1-methylbutyl)malonylurea; Barbosec; Evronal; Hypotrol; Immenox; Meballymal; 2,4,6(1H,3H,5H)-Pyrimidinitrione, 5-(1-methylbutyl)-5-(2-propenyl)-; Quinalbarbital; Quinalbarbitone; Secobarbitone; Seconal; 5-Allyl-5-(1-methylbutyl)-2,4,6(1H,3H,5H)-pyrimidinetrione; (.+/-.))-Secobarbital; 2,4,6(1H,3H,5H)-Pyrimidinetrione, 5-(1-methylbutyl)-5-(2-propen-1-yl)-; Imesonal; Immenoctal; Trisomnin; Hyptran; 5-(1-Methylbutyl)-5-(2-propen-1-yl)-2,4,6(1H,3H,5H)-pyrimidinetrione (secobarbital)

Phase change data

Data compiled as indicated in comments:
TRC - Thermodynamics Research Center, NIST Boulder Laboratories, Chris Muzny director
AC - William E. Acree, Jr., James S. Chickos
Quantity | Value | Units | Method | Reference | Comment |
---|---|---|---|---|---|
Tfus | 356.7 | K | N/A | Kuffner, Bush, et al., 1957 | Uncertainty assigned by TRC = 2. K; not clear that this was measured by author; TRC |
Enthalpy of fusion
ΔfusH (kJ/mol) | Temperature (K) | Method | Reference | Comment |
---|---|---|---|---|
22.9 | 371.8 | DSC | Wassvik, Holmén, et al., 2008 | AC |

Kovats' RI, non-polar column, isothermal

Data compiled by: NIST Mass Spectrometry Data Center, William E. Wallace, director

Column type CapillaryCapillaryCapillaryCapillaryPacked
Active phase DB-5BP-1BP-1SPB-1SE-30
Column length (m) 15.25.25.25.
Carrier gas HeN2N2He
Substrate
Column diameter (mm) 0.250.220.530.20
Phase thickness (μm) 0.20.251.
Temperature (C) 220.200.200.250.200.
I 1810.1772.1777.1786.1770.
ReferencePhillips, Logan, et al., 1990Japp, Gill, et al., 1987Japp, Gill, et al., 1987Lora-Tamayo, Rams, et al., 1986Stead, Gill, et al., 1982
Comment MSDC-RI MSDC-RI MSDC-RI MSDC-RI MSDC-RI
Column type PackedPackedPackedPackedPacked
Active phase OV-1OV-101OV-101OV-101OV-101
Column length (m)  2.2.2.2.
Carrier gas  N2N2N2N2
Substrate  Chromosorb G AW DMCS (80-100 mesh)Chromosorb G AW DMCS (80-100 mesh)Chromosorb G AW DMCS (80-100 mesh)Chromosorb G AW DMCS (80-100 mesh)
Column diameter (mm)
Phase thickness (μm)
Temperature (C) 200.200.200.200.200.
I 1790.1790.1790.1795.1815.
ReferenceBerninger and Möller, 1977Möller, 1976Möller, 1976Möller, 1976Möller, 1976
Comment MSDC-RI MSDC-RI MSDC-RI MSDC-RI MSDC-RI

Van Den Dool and Kratz RI, non-polar column, temperature ramp

Data compiled by: NIST Mass Spectrometry Data Center, William E. Wallace, director

Column type CapillaryCapillaryCapillaryCapillaryCapillary
Active phase VF-5MSSPB-1DB-1Methyl Silicone5 % Phenyl methyl siloxane
Column length (m) 30.30.15.12.12.
Carrier gas HeHeHeHeHe
Substrate
Column diameter (mm) 0.250.750.320.20.2
Phase thickness (μm) 0.251.00.250.330.33
Tstart (C) 60.160.120.50.50.
Tend (C) 270.280.280.300.300.
Heat rate (K/min)  10.8.20.20.
Initial hold (min)    1.1.
Final hold (min)  12.5.3.3.
I 1831.31791.1769.1763.01813.0
ReferenceTretyakov, 2014Christ, Noomano, et al., 1988Perrigo, Peel, et al., 1985Newton and Foery, 1984Newton and Foery, 1984
Comment MSDC-RI MSDC-RI MSDC-RI MSDC-RI MSDC-RI
Column type CapillaryPacked
Active phase DB-1SE-30
Column length (m) 15.1.8
Carrier gas HeN2
Substrate  Chromosorb W
Column diameter (mm) 0.25
Phase thickness (μm) 0.25
Tstart (C) 120.130.
Tend (C) 280.290.
Heat rate (K/min) 8.8.
Initial hold (min)  2.
Final hold (min) 5.8.
I 1769.1790.
ReferencePerrigo, Ballantyne, et al., 1984Perrigo and Peel, 1981
Comment MSDC-RI MSDC-RI

Normal alkane RI, non-polar column, custom temperature program

Data compiled by: NIST Mass Spectrometry Data Center, William E. Wallace, director

Column type CapillaryCapillaryCapillaryOtherOther
Active phase BP-1BP-1OV-1, SE-30, Methyl silicone, SP-2100, OV-101, DB-1, etc.Methyl SiliconeMethyl Silicone
Column length (m) 12.12.50.
Carrier gas HeHeHydrogen
Substrate
Column diameter (mm) 0.220.220.32
Phase thickness (μm) 0.250.25
Program 120 0X 8 0C/min -> 270 0C 25 0C/min -> 300 0C (5 min)not specifiednot specifiednot specifiednot specified
I 1763.1775.1786.1791.1790.
ReferenceStowell and Wilson, 1985Stowell and Wilson, 1985Waggott and Davies, 1984Ardrey and Moffat, 1981Ardrey and Moffat, 1981
Comment MSDC-RI MSDC-RI MSDC-RI MSDC-RI MSDC-RI

References

Kuffner, Bush, et al., 1957
Kuffner, R.J.; Bush, M.T.; Bircher, L.J.,
Studies on the surface tension of aqueous barbituric acid solutions,
J. Am. Chem. Soc., 1957, 79, 1587-1589. [all data]
Wassvik, Holmén, et al., 2008
Wassvik, Carola M.; Holmén, Anders G.; Draheim, Rieke; Artursson, Per; Bergström, Christel A.S.,
Molecular Characteristics for Solid-State Limited Solubility,
J. Med. Chem., 2008, 51, 10, 3035-3039, https://doi.org/10.1021/jm701587d
. [all data]