Cyclohexanol, 3,3-dimethyl-
- Formula: C8H16O
- Molecular weight: 128.2120
- IUPAC Standard InChIKey: DQBDGNSFXSCBJX-UHFFFAOYSA-N
- CAS Registry Number: 767-12-4
- Chemical structure:
View 3d structure (requires JavaScript / HTML 5) - Stereoisomers:
- Other names: 3,3-Dimethylcyclohexanol

Phase change data

Data compiled by: Thermodynamics Research Center, NIST Boulder Laboratories, Chris Muzny director
Quantity | Value | Units | Method | Reference | Comment |
---|---|---|---|---|---|
Tboil | 456. | K | N/A | Zelinskii, Packendorff, et al., 1935 | Uncertainty assigned by TRC = 2. K |
Tboil | 457. | K | N/A | Zelinskii, Packendorff, et al., 1935 | Uncertainty assigned by TRC = 2. K |
Quantity | Value | Units | Method | Reference | Comment |
Tfus | 284.7 | K | N/A | Zelinskii, Packendorff, et al., 1935 | Uncertainty assigned by TRC = 2. K |
Tfus | 284. | K | N/A | Crossley and Renouf, 1905 | Uncertainty assigned by TRC = 3. K |

References

Zelinskii, Packendorff, et al., 1935
Zelinskii, N.D.; Packendorff, K.; Ghochllowa, E.G.,
Preparation and Properties of gem Dimethylcyclohexanes by Nobel Metal Catalysis,
Ber. Dtsch. Chem. Ges., 1935, 68, 98-101. [all data]
Crossley and Renouf, 1905
Crossley, A.W.; Renouf, N.,
Synthesis opf 1:1-Dimethylhexahydrobenzene and of 1,1-Dimethyl-Δ3- tetrahydrobenzene,
J. Chem. Soc., 1905, 87, 1487. [all data]