1-Hexene ozonide

Phase change data

Data compiled by: William E. Acree, Jr., James S. Chickos

Enthalpy of vaporization

ΔvapH (kJ/mol) Temperature (K) Method Reference Comment
43.9363.MMBoldenkov and Maksimov, 1977Based on data from 353. - 373. K.

References

Boldenkov and Maksimov, 1977
Boldenkov, N.I.; Maksimov, Y.Y., Zh. Fiz. Khim., 1977, 51, 1502. [all data]