Benzene, (ethenyloxy)-
- Formula: C8H8O
- Molecular weight: 120.1485
- IUPAC Standard InChIKey: NHOGGUYTANYCGQ-UHFFFAOYSA-N
- CAS Registry Number: 766-94-9
- Chemical structure:
View 3d structure (requires JavaScript / HTML 5) - Other names: Ether, phenyl vinyl; (Vinyloxy)benzene; Phenoxyethene; Phenoxyethylene; Phenyl vinyl ether; Vinyl phenyl ether; Ethenyl phenyl ether

Gas phase thermochemistry data

Data compiled by: Donald R. Burgess, Jr.
Quantity | Value | Units | Method | Reference | Comment |
---|---|---|---|---|---|
ΔfH°gas | 23.0 ± 2.2 | kJ/mol | N/A | Trofimov, Nedolya, et al., 1981 | Value computed using ΔfHliquid° value of -26±0.8 kj/mol from Trofimov, Nedolya, et al., 1981 and ΔvapH° value of 49±2 kj/mol from missing citation. |

Condensed phase thermochemistry data

Data compiled by: Hussein Y. Afeefy, Joel F. Liebman, and Stephen E. Stein
Quantity | Value | Units | Method | Reference | Comment |
---|---|---|---|---|---|
ΔfH°liquid | -26. ± 0.8 | kJ/mol | Ccb | Trofimov, Nedolya, et al., 1981 | |
Quantity | Value | Units | Method | Reference | Comment |
ΔcH°liquid | -4265.2 ± 0.8 | kJ/mol | Ccb | Trofimov, Nedolya, et al., 1981 | Corresponding ΔfHºliquid = -26. kJ/mol (simple calculation by NIST; no Washburn corrections) |
ΔcH°liquid | -4265.6 ± 9.6 | kJ/mol | Ccb | Favorskii and Shostakovskii, 1943 | Corresponding ΔfHºliquid = -26. kJ/mol (simple calculation by NIST; no Washburn corrections) |

Phase change data

Data compiled as indicated in comments:
BS - Robert L. Brown and Stephen E. Stein
ALS - Hussein Y. Afeefy, Joel F. Liebman, and Stephen E. Stein
Quantity | Value | Units | Method | Reference | Comment |
---|---|---|---|---|---|
Tboil | 428.7 | K | N/A | Weast and Grasselli, 1989 | BS |
Quantity | Value | Units | Method | Reference | Comment |
ΔvapH° | 49. ± 2. | kJ/mol | V | Trofimov, Nedolya, et al., 1981 | ALS |

References

Trofimov, Nedolya, et al., 1981
Trofimov, B.A.; Nedolya, N.A.; Lebedeva, N.D.; Ryadchenko, V.L.; Masalitionova, T.N.; Dobichin, S.L.; Zacheslavskaya, R.Kh.; Petrov, G.N.,
Thermochemical and quantochemical estimationof the conjungation energy of vinyl ethers.,
Izv. Akad. Nauk SSSR, Ser. Khim., 1981, 30, 752-753. [all data]
Favorskii and Shostakovskii, 1943
Favorskii, A.E.; Shostakovskii, M.F.,
Vinyl ethers. I. Synthesis and properties of vinyl ethers,
Zh. Obshch. Kim., 1943, 13, 1-20. [all data]
Weast and Grasselli, 1989
CRC Handbook of Data on Organic Compounds, 2nd Editon, Weast,R.C and Grasselli, J.G., ed(s)., CRC Press, Inc., Boca Raton, FL, 1989, 1. [all data]