Formamide, N-cyclohexyl-
- Formula: C7H13NO
- Molecular weight: 127.1842
- IUPAC Standard InChIKey: SWGXDLRCJNEEGZ-UHFFFAOYSA-N
- CAS Registry Number: 766-93-8
- Chemical structure:
View 3d structure (requires JavaScript / HTML 5) - Other names: Cyclohexylformamide; Formamidocyclohexane; N-Cyclohexylformamide

Phase change data

Data compiled as indicated in comments:
BS - Robert L. Brown and Stephen E. Stein
TRC - Thermodynamics Research Center, NIST Boulder Laboratories, Chris Muzny director
Quantity | Value | Units | Method | Reference | Comment |
---|---|---|---|---|---|
Tfus | 312.4 | K | N/A | Zeltner, Huber, et al., 1979 | Uncertainty assigned by TRC = 0.6 K; TRC |
Reduced pressure boiling point
Tboil (K) | Pressure (bar) | Reference | Comment |
---|---|---|---|
386.2 | 0.933 | Aldrich Chemical Company Inc., 1990 | BS |
418. to 419. | 0.020 | Frinton Laboratories Inc., 1986 | BS |

Kovats' RI, non-polar column, isothermal

Column type | Active phase | Temperature (C) | I | Reference | Comment |
---|---|---|---|---|---|
Packed | SE-30 | 180. | 1306. | Krawczyk and Piotrowski, 1989 | N2, Chromosorb W AW; Column length: 1. m |

References

Zeltner, Huber, et al., 1979
Zeltner, P.; Huber, G.A.; Peters, R.; Tatrai, F.; Boksanyi, L.; Kovats, E.S.,
Preparation of Branched Paraffins in the Oligomer Range,
Helv. Chim. Acta, 1979, 62, 2495. [all data]
Aldrich Chemical Company Inc., 1990
Aldrich Chemical Company Inc.,
Catalog Handbook of Fine Chemicals, Aldrich Chemical Company, Inc., Milwaukee WI, 1990, 1. [all data]
Frinton Laboratories Inc., 1986
Frinton Laboratories Inc.,
Catalog Number 11, Frinton Laboratories Inc., Vineland, NJ, 1986, 99. [all data]
Krawczyk and Piotrowski, 1989
Krawczyk, W.; Piotrowski, G.T.,
Relationships Between Structure and Retention Index for N-Substituted Amides of Aliphatic Acids on a Non-Polar Column,
J. Chromatogr., 1989, 463, 297-304, https://doi.org/10.1016/S0021-9673(01)84484-8
. [all data]