Tetraoctacontane

Phase change data

Data compiled by: William E. Acree, Jr., James S. Chickos

Quantity Value Units Method Reference Comment
Δvap394.0 ± 3.9kJ/molCGCChickos and Lipkind, 2008Based on data from 638. - 691. K.

Enthalpy of vaporization

ΔvapH (kJ/mol) Temperature (K) Method Reference Comment
187.3711.A,EStephenson and Malanowski, 1987Based on data from 696. - 960. K. See also Kudchadker and Zwolinski, 1966.

References

Chickos and Lipkind, 2008
Chickos, James; Lipkind, Dmitry, Hypothetical Thermodynamic Properties: Vapor Pressures and Vaporization Enthalpies of the Even n -Alkanes from C 78 to C 92 at T = 298.15 K by Correlation-Gas Chromatography, J. Chem. Eng. Data, 2008, 53, 10, 2432-2440, https://doi.org/10.1021/je800442s . [all data]

Stephenson and Malanowski, 1987
Stephenson, Richard M.; Malanowski, Stanislaw, Handbook of the Thermodynamics of Organic Compounds, 1987, https://doi.org/10.1007/978-94-009-3173-2 . [all data]

Kudchadker and Zwolinski, 1966
Kudchadker, A.P.; Zwolinski, B.J., Vapor Pressure and Boiling Points of Normal Alkanes, C 21 to C 100 ., J. Chem. Eng. Data, 1966, 11, 2, 253-255, https://doi.org/10.1021/je60029a039 . [all data]