octapentacontane
- Formula: C58H118
- Molecular weight: 815.5575
- IUPAC Standard InChIKey: HDKSWQPFGWHOIA-UHFFFAOYSA-N
- CAS Registry Number: 7667-78-9
- Chemical structure:
View 3d structure (requires JavaScript / HTML 5) - Permanent link for this species. Use this link for bookmarking this species for future reference.

Phase change data

Data compiled as indicated in comments:
TRC - Thermodynamics Research Center, NIST Boulder Laboratories, Chris Muzny director
AC - William E. Acree, Jr., James S. Chickos
Quantity | Value | Units | Method | Reference | Comment |
---|---|---|---|---|---|
Tfus | 370. | K | N/A | Slowinski, Walter, et al., 1956 | Uncertainty assigned by TRC = 2. K; TRC |
Tfus | 373. | K | N/A | Geiger-Berschandy, 1955 | Uncertainty assigned by TRC = 5. K; TRC |
Quantity | Value | Units | Method | Reference | Comment |
ΔvapH° | 288.5 ± 1.8 | kJ/mol | CGC | Chickos, Wang, et al., 2008 | Based on data from 323. to 523. K.; AC |
Enthalpy of vaporization
ΔvapH (kJ/mol) | Temperature (K) | Method | Reference | Comment |
---|---|---|---|---|
160.3 | 647. | A,E | Stephenson and Malanowski, 1987 | Based on data from 632. to 886. K. See also Kudchadker and Zwolinski, 1966.; AC |

References

Slowinski, Walter, et al., 1956
Slowinski; Walter; Miller,
J. Polym. Sci., 1956, 19, 353. [all data]
Geiger-Berschandy, 1955
Geiger-Berschandy, S.,
Bull. Soc. Chim. Fr., 1955, 1955, 994. [all data]
Chickos, Wang, et al., 2008
Chickos, James; Wang, Tracy; Sharma, Esseim,
Hypothetical Thermodynamic Properties: Vapor Pressures and Vaporization Enthalpies of the Even n -Alkanes from C 40 to C 76 at T = 298.15 K by Correlation-Gas Chromatography. Are the Vaporization Enthalpies a Linear Function of Carbon Number?,
J. Chem. Eng. Data, 2008, 53, 2, 481-491, https://doi.org/10.1021/je7005852
. [all data]
Stephenson and Malanowski, 1987
Stephenson, Richard M.; Malanowski, Stanislaw,
Handbook of the Thermodynamics of Organic Compounds, 1987, https://doi.org/10.1007/978-94-009-3173-2
. [all data]
Kudchadker and Zwolinski, 1966
Kudchadker, A.P.; Zwolinski, B.J.,
Vapor Pressure and Boiling Points of Normal Alkanes, C 21 to C 100 .,
J. Chem. Eng. Data, 1966, 11, 2, 253-255, https://doi.org/10.1021/je60029a039
. [all data]