Nonacontane
- Formula: C90H182
- Molecular weight: 1264.4081
- CAS Registry Number: 7667-51-8

Phase change data

Data compiled by: William E. Acree, Jr., James S. Chickos
Quantity | Value | Units | Method | Reference | Comment |
---|---|---|---|---|---|
ΔvapH° | 416.4 ± 4.3 | kJ/mol | CGC | Chickos and Lipkind, 2008 | Based on data from 638. to 691. K. |
Enthalpy of vaporization
ΔvapH (kJ/mol) | Temperature (K) | Method | Reference | Comment |
---|---|---|---|---|
191.6 | 722. | A,E | Stephenson and Malanowski, 1987 | Based on data from 707. to 971. K. See also Kudchadker and Zwolinski, 1966. |

References

Chickos and Lipkind, 2008
Chickos, James; Lipkind, Dmitry,
Hypothetical Thermodynamic Properties: Vapor Pressures and Vaporization Enthalpies of the Even n -Alkanes from C 78 to C 92 at T = 298.15 K by Correlation-Gas Chromatography,
J. Chem. Eng. Data, 2008, 53, 10, 2432-2440, https://doi.org/10.1021/je800442s
. [all data]
Stephenson and Malanowski, 1987
Stephenson, Richard M.; Malanowski, Stanislaw,
Handbook of the Thermodynamics of Organic Compounds, 1987, https://doi.org/10.1007/978-94-009-3173-2
. [all data]
Kudchadker and Zwolinski, 1966
Kudchadker, A.P.; Zwolinski, B.J.,
Vapor Pressure and Boiling Points of Normal Alkanes, C 21 to C 100 .,
J. Chem. Eng. Data, 1966, 11, 2, 253-255, https://doi.org/10.1021/je60029a039
. [all data]