2,5-Furandione, 3,4-dimethyl-
- Formula: C6H6O3
- Molecular weight: 126.1100
- IUPAC Standard InChIKey: MFGALGYVFGDXIX-UHFFFAOYSA-N
- CAS Registry Number: 766-39-2
- Chemical structure:
View 3d structure (requires JavaScript / HTML 5) - Other names: Maleic anhydride, dimethyl-; Dimethylmaleic acid anhydride; Dimethylmaleic anhydride; Pyrocinchonic anhydride; 2,3-Dimethylmaleic anhydride; 3,4-Dimethyl-2,5-furandione; α,β-Dimethylmaleic anhydride; Anhydride of dimethylmaleic acid; 3,4-Dimethyl-2,5-furanedione; NSC 92512

Condensed phase thermochemistry data

Data compiled by: Hussein Y. Afeefy, Joel F. Liebman, and Stephen E. Stein
Quantity | Value | Units | Method | Reference | Comment |
---|---|---|---|---|---|
ΔfH°solid | -137.3 | kcal/mol | Ccb | Stern and Klebs, 1933 | Heat of combustion at 288 K |
Quantity | Value | Units | Method | Reference | Comment |
ΔcH°solid | -630.30 ± 0.60 | kcal/mol | Ccb | Stern and Klebs, 1933 | Reanalyzed by Cox and Pilcher, 1970, Original value = -632.0 kcal/mol; Heat of combustion at 288 K; Corresponding ΔfHºsolid = -138.95 kcal/mol (simple calculation by NIST; no Washburn corrections) |

Gas phase ion energetics data

Data compiled by: John E. Bartmess
Electron affinity determinations
EA (eV) | Method | Reference | Comment |
---|---|---|---|
1.162 ± 0.087 | TDEq | Paul and Kebarle, 1989 | ΔGea(423 K) = -26.2±1 kcal/mol, ΔS = -2±3 eu |

Phase change data

Data compiled by: Robert L. Brown and Stephen E. Stein

Quantity Value Units Method Reference Comment
Tboil496.2KN/AWeast and Grasselli, 1989

Normal alkane RI, polar column, temperature ramp

Data compiled by: NIST Mass Spectrometry Data Center, William E. Wallace, director

Column type CapillaryCapillaryCapillaryCapillary
Active phase FFAPFFAPCarbowax 20MCarbowax 20M
Column length (m) 30.30.60.50.
Carrier gas NitrogenN2 He
Substrate
Column diameter (mm) 0.320.320.250.25
Phase thickness (μm) 0.500.5
Tstart (C) 35.35.60.60.
Tend (C) 250.320.180.180.
Heat rate (K/min) 4.4.2.2.
Initial hold (min) 5.5.4.4.
Final hold (min) 45.45.
I 1764.1764.1685.1685.
ReferenceBudryn, Nebesny, et al., 2011Nebesny, Budryn, et al., 2007Kawakami, Ganguly, et al., 1995Kawakami, Kobayashi, et al., 1993
Comment MSDC-RI MSDC-RI MSDC-RI MSDC-RI

References

Stern and Klebs, 1933
Stern, A.; Klebs, G.,
Calorimetrische bestimmungen bei mehrkernigen pyrrolderivaten. IV. 1. Experimentelle daten fur einige porphyrine, chlorine, phaophorbide and purpurine,
Ann. Chim., 1933, 505, 295-306. [all data]
Cox and Pilcher, 1970
Cox, J.D.; Pilcher, G.,
Thermochemistry of Organic and Organometallic Compounds, Academic Press, New York, 1970, 1-636. [all data]
Paul and Kebarle, 1989
Paul, G.; Kebarle, P.,
Electron Affinities of Cyclic Unsaturated Dicarbonyls: Maleic Anhydrides, Maleimides, and Cyclopentendione,
J. Am. Chem. Soc., 1989, 111, 2, 464, https://doi.org/10.1021/ja00184a009
. [all data]