2,3,3-Trichloro-2-propenethioic acid, O-hexyl ester

Phase change data

Data compiled by: William E. Acree, Jr., James S. Chickos

Enthalpy of vaporization

ΔvapH (kJ/mol) Temperature (K) Method Reference
69.5433. - 483.GCPityugin, Kislitsyna, et al., 1980

References

Pityugin, Kislitsyna, et al., 1980
Pityugin, V.S.; Kislitsyna, T.L.; Shakirov, R.F.; Sharif'yanova, L.N.; Maslennikov, E.N., Khim. Prom-st. Ser. Khlornaya Prom-st., 1980, 11. [all data]