Piperidine, 2,6-dimethyl-, (2R,6S)-rel-

Phase change data

Data compiled as indicated in comments:
BS - Robert L. Brown and Stephen E. Stein
AC - William E. Acree, Jr., James S. Chickos

Quantity Value Units Method Reference Comment
Δvap41.3 ± 0.1kJ/molN/AMokbel, Razzouk, et al., 2009Based on data from 295. - 365. K.; AC
Δvap42.4 ± 0.6kJ/molCRibeiro da Silva, Cabral, et al., 2006Authors indicate that the compound is cis 2,6-dimethylpiperidine; however they give the CAS registry number of 504-03-0 (which does not specify cis or trans isomer).; AC

Reduced pressure boiling point

Tboil (K) Pressure (bar) Reference Comment
400.71.02Aldrich Chemical Company Inc., 1990BS

Enthalpy of vaporization

ΔvapH (kJ/mol) Temperature (K) Reference Comment
39.7 ± 0.1330.Mokbel, Razzouk, et al., 2009Based on data from 295. - 365. K.; AC

References

Mokbel, Razzouk, et al., 2009
Mokbel, Ilham; Razzouk, Antonio; Sawaya, Terufat; Jose, Jacques, Experimental Vapor Pressures of 2-Phenylethylamine, Benzylamine, Triethylamine, and cis -2,6-Dimethylpiperidine in the Range between 0.2 Pa and 75 kPa, J. Chem. Eng. Data, 2009, 54, 3, 819-822, https://doi.org/10.1021/je800603z . [all data]

Ribeiro da Silva, Cabral, et al., 2006
Ribeiro da Silva, Manuel A.V.; Cabral, Joana I.T.A.; Gomes, Paula; Gomes, José R.B., Combined Experimental and Computational Study of the Thermochemistry of Methylpiperidines, J. Org. Chem., 2006, 71, 10, 3677-3685, https://doi.org/10.1021/jo052468w . [all data]

Aldrich Chemical Company Inc., 1990
Aldrich Chemical Company Inc., Catalog Handbook of Fine Chemicals, Aldrich Chemical Company, Inc., Milwaukee WI, 1990, 1. [all data]