Quinoline, 5-methyl-
- Formula: C10H9N
- Molecular weight: 143.1852
- IUPAC Standard InChIKey: LMYVCXSKCQSIEQ-UHFFFAOYSA-N
- CAS Registry Number: 7661-55-4
- Chemical structure:
View 3d structure (requires JavaScript / HTML 5) - Other names: 5-Methylquinoline

Phase change data

Data compiled by: Thermodynamics Research Center, NIST Boulder Laboratories, Chris Muzny director
Quantity | Value | Units | Method | Reference | Comment |
---|---|---|---|---|---|
Tboil | 531. | K | N/A | Cumper, Redford, et al., 1962 | Uncertainty assigned by TRC = 2. K |

References

Cumper, Redford, et al., 1962
Cumper, C.W.N.; Redford, D.G.; Vogel, A.I.,
Physical properties and chemical constitution. The eletric dipole moments of methylquinolines,
J. Chem. Soc., 1962, 1962, 1176. [all data]