Isoquinoline, 1-butyl-
- Formula: C13H15N
- Molecular weight: 185.2649
- IUPAC Standard InChIKey: KXAVXNWSOPHOON-UHFFFAOYSA-N
- CAS Registry Number: 7661-38-3
- Chemical structure:
View 3d structure (requires JavaScript / HTML 5) - Other names: 1-Butylisoquinoline

Normal alkane RI, non-polar column, custom temperature program

Column type | Active phase | I | Reference | Comment |
---|---|---|---|---|
Packed | SE-30 | 1636. | Xiaoyun, Xiammou, et al., 1991 | Column length: 2. m; Program: not specified |

References

Xiaoyun, Xiammou, et al., 1991
Xiaoyun, J.; Xiammou, Z.; Yijian, G.,
Kovats retention indices of some alkylquinolines, alkylisoquinolines, phenylalkyl- and phenoxyalkylpyridines,
Chin, J, Chromatogr., 1991, 9, 3, 187-191. [all data]