Piperidine, 1-ethyl-
- Formula: C7H15N
- Molecular weight: 113.2007
- IUPAC Standard InChIKey: HTLZVHNRZJPSMI-UHFFFAOYSA-N
- CAS Registry Number: 766-09-6
- Chemical structure:
View 3d structure (requires JavaScript / HTML 5) - Other names: N-Ethylpiperidine; 1-Ethylpiperidine; 1-Ethylpiperidene; N-Aethylpiperidin; UN 2386

Phase change data

Data compiled as indicated in comments:
BS - Robert L. Brown and Stephen E. Stein
TRC - Thermodynamics Research Center, NIST Boulder Laboratories, Chris Muzny director
AC - William E. Acree, Jr., James S. Chickos
Quantity | Value | Units | Method | Reference | Comment |
---|---|---|---|---|---|
Tboil | 404.0 | K | N/A | Weast and Grasselli, 1989 | BS |
Tboil | 403.95 | K | N/A | Magnusson and Schierz, 1940 | Uncertainty assigned by TRC = 0.4 K; TRC |
Tboil | 400.15 | K | N/A | Winans and Adkins, 1932 | Uncertainty assigned by TRC = 3. K; TRC |
Quantity | Value | Units | Method | Reference | Comment |
ΔvapH° | 39.4 ± 0.7 | kJ/mol | C | Ribeiro da Silva, Cabral, et al., 2006 | AC |
ΔvapH° | 40.8 ± 0.6 | kJ/mol | GS | Verevkin, 1998 | Based on data from 274. to 313. K.; AC |
Enthalpy of vaporization
ΔvapH (kJ/mol) | Temperature (K) | Method | Reference | Comment |
---|---|---|---|---|
41.1 ± 0.6 | 294. | GS | Verevkin, 1998 | Based on data from 274. to 313. K.; AC |

Kovats' RI, non-polar column, isothermal

Column type | Active phase | Temperature (C) | I | Reference | Comment |
---|---|---|---|---|---|
Capillary | OV-101 | 110. | 850. | Zhuravleva, 2000 | 50. m/0.3 mm/0.4 μm, He |
Capillary | OV-101 | 110. | 852. | Zhuravleva, Golovnya, et al., 1993 | 50. m/0.30 mm/0.40 μm, He |
Packed | Apiezon L | 100. | 858. | Zhuravleva, Kapustin, et al., 1976 | N2 or He, Chromosorb G, AW; Column length: 2.7 m |
Packed | PMS-100 | 130. | 851. | Anderson, Jurel, et al., 1973 | He, Celite 545 (44-60 mesh); Column length: 3. m |
Packed | PMS-100 | 150. | 851. | Anderson, Jurel, et al., 1973 | He, Celite 545 (44-60 mesh); Column length: 3. m |
Packed | PMS-100 | 180. | 857. | Anderson, Jurel, et al., 1973 | He, Celite 545 (44-60 mesh); Column length: 3. m |

Kovats' RI, polar column, isothermal

Column type | Active phase | Temperature (C) | I | Reference | Comment |
---|---|---|---|---|---|
Packed | PEG-2000 | 150. | 1054. | Anderson, Jurel, et al., 1973 | He, Celite 545 (44-60 mesh); Column length: 3. m |
Packed | PEG-2000 | 152. | 1022. | Anderson, Jurel, et al., 1973 | He, Celite 545 (44-60 mesh); Column length: 3. m |
Packed | PEG-2000 | 179. | 1045. | Anderson, Jurel, et al., 1973 | He, Celite 545 (44-60 mesh); Column length: 3. m |
Packed | PEG-2000 | 180. | 1075. | Anderson, Jurel, et al., 1973 | He, Celite 545 (44-60 mesh); Column length: 3. m |
Packed | PEG-2000 | 200. | 1060. | Anderson, Jurel, et al., 1973 | He, Celite 545 (44-60 mesh); Column length: 3. m |
Packed | PEG-2000 | 200. | 1093. | Anderson, Jurel, et al., 1973 | He, Celite 545 (44-60 mesh); Column length: 3. m |

Normal alkane RI, non-polar column, custom temperature program

Column type | Active phase | I | Reference | Comment |
---|---|---|---|---|
Capillary | Methyl Silicone | 856. | Farkas, Héberger, et al., 2004 | Program: not specified |

References

Weast and Grasselli, 1989
CRC Handbook of Data on Organic Compounds, 2nd Editon, Weast,R.C and Grasselli, J.G., ed(s)., CRC Press, Inc., Boca Raton, FL, 1989, 1. [all data]
Magnusson and Schierz, 1940
Magnusson, H.W.; Schierz, E.R.,
A Study of SOme Physical Constants of N-n-Alkylpiperidines,
Univ. Wyo. Publ., 1940, 7, 1. [all data]
Winans and Adkins, 1932
Winans, C.F.; Adkins, H.,
The Alkylation of Amines as Catalyzed by Nickel,
J. Am. Chem. Soc., 1932, 54, 306. [all data]
Ribeiro da Silva, Cabral, et al., 2006
Ribeiro da Silva, Manuel A.V.; Cabral, Joana I.T.A.; Gomes, José R.B.,
Experimental and computational study on the thermochemistry of ethylpiperidines,
The Journal of Chemical Thermodynamics, 2006, 38, 8, 1072-1078, https://doi.org/10.1016/j.jct.2005.11.004
. [all data]
Verevkin, 1998
Verevkin, Sergey P.,
Structural Chemistry, 1998, 9, 2, 113-119, https://doi.org/10.1023/A:1022459803871
. [all data]
Zhuravleva, 2000
Zhuravleva, I.L.,
Evaluation of the polarity and boiling points of nitrogen-containing heterocyclic compounds by gas chromatography,
Russ. Chem. Bull. (Engl. Transl.), 2000, 49, 2, 325-328, https://doi.org/10.1007/BF02494682
. [all data]
Zhuravleva, Golovnya, et al., 1993
Zhuravleva, I.L.; Golovnya, R.V.; Kuzmenko, T.E.,
The regularities of the gas-chromatographic behavior of methyl-substituted N-alkylpiperidines,
Russ. Chem. Bull. (Engl. Transl.), 1993, 42, 10, 1677-1679, https://doi.org/10.1007/BF00697038
. [all data]
Zhuravleva, Kapustin, et al., 1976
Zhuravleva, I.L.; Kapustin, Yu.P.; Golovnya, P.B.,
Retention indices of some isoaliphatic and heterocyclic nitrogenous bases,
Zh. Anal. Khim., 1976, 31, 1378-1380. [all data]
Anderson, Jurel, et al., 1973
Anderson, A.; Jurel, S.; Shymanska, M.; Golender, L.,
Gas-liquid chromatography of some aliphatic and heterocyclic mono- and pollyfunctional amines. VII. Retention indices of amines in some polar and unpolar stationary phases,
Latv. PSR Zinat. Akad. Vestis Kim. Ser., 1973, 1, 51-63. [all data]
Farkas, Héberger, et al., 2004
Farkas, O.; Héberger, K.; Zenkevich, I.G.,
Quantitative structure-retention relationships. XIV. Prediction of gas chromatographic retention indices for saturated O-, N-, and S-heterocyclic compounds,
Chemom. Intell. Lab. Syst., 2004, 72, 2, 173-184, https://doi.org/10.1016/j.chemolab.2004.01.012
. [all data]