Cyclohexene, 3-ethenyl-
- Formula: C8H12
- Molecular weight: 108.1809
- IUPAC Standard InChIKey: YYTUUFMWKBIPEY-UHFFFAOYSA-N
- CAS Registry Number: 766-03-0
- Chemical structure:

Normal alkane RI, non-polar column, custom temperature program

Column type | Active phase | I | Reference | Comment |
---|---|---|---|---|
Capillary | Squalane | 825. | Chen, 2008 | Program: not specified |
Capillary | Squalane | 833. | Chen, 2008 | Program: not specified |

References

Chen, 2008
Chen, H.-F.,
Quantitative prediction of gas chromatography retention indices with support vector machines, radial basis neutral networks and multiple linear regression,
Anal. Chim. Acta, 2008, 609, 1, 24-36, https://doi.org/10.1016/j.aca.2008.01.003
. [all data]