Bicyclo[2.2.1]heptane, 2-chloro-, exo-
- Formula: C7H11Cl
- Molecular weight: 130.615
- IUPAC Standard InChIKey: PJWBUKHIZPKRJF-KPGICGJXSA-N
- CAS Registry Number: 765-91-3
- Chemical structure:
- Other names: Norbornane, 2-chloro-, exo-; exo-2-Chloronorbornane; exo-2-Norbornyl chloride; exo-Norbornyl chloride; 2-Chlorobicyclo[2.2.1]heptane, exo-; 2-exo-Chloronorbornane

Condensed phase thermochemistry data

Data compiled by: Hussein Y. Afeefy, Joel F. Liebman, and Stephen E. Stein
Quantity | Value | Units | Method | Reference | Comment |
---|---|---|---|---|---|
ΔfH°liquid | -131. ± 2. | kJ/mol | Cm | Arnett and Pienta, 1980 | Hydrochlorination |

Reaction thermochemistry data

Data compiled by: Hussein Y. Afeefy, Joel F. Liebman, and Stephen E. Stein
Individual Reactions
By formula: C7H10 + HCl = C7H11Cl
Quantity | Value | Units | Method | Reference | Comment |
---|---|---|---|---|---|
ΔrH° | -70.9 ± 1.5 | kJ/mol | Cm | Arnett and Pienta, 1980 | liquid phase; solvent: Methylene chloride; Hydrochlorination |

References

Arnett and Pienta, 1980
Arnett, E.M.; Pienta, N.J.,
Stabilities of carbonium ions in solution. 12. Heats of formation of alkyl chlorides as an entree to heats of solvation of aliphatic carbonium ions,
J. Am. Chem. Soc., 1980, 102, 3329-3334. [all data]