Cyclopropyl methyl carbinol
- Formula: C5H10O
- Molecular weight: 86.1323
- IUPAC Standard InChIKey: DKKVKJZXOBFLRY-UHFFFAOYSA-N
- CAS Registry Number: 765-42-4
- Chemical structure:
View 3d structure (requires JavaScript / HTML 5) - Other names: Methylcyclopropylcarbinol; 1-Cyclopropylethanol; Cyclopropylethanol; Cyclopropanemethanol, α-methyl-; α-Methylcyclopropanemethanol; alpha-methylcyclopropanemethanol

Phase change data

Data compiled as indicated in comments:
BS - Robert L. Brown and Stephen E. Stein
TRC - Thermodynamics Research Center, NIST Boulder Laboratories, Chris Muzny director
Quantity | Value | Units | Method | Reference | Comment |
---|---|---|---|---|---|
Tboil | 394.2 | K | N/A | Aldrich Chemical Company Inc., 1990 | BS |
Tboil | 396.65 | K | N/A | Van Volkenburgh, Greenlee, et al., 1949 | Uncertainty assigned by TRC = 0.5 K; TRC |
Quantity | Value | Units | Method | Reference | Comment |
Tfus | 241.05 | K | N/A | Van Volkenburgh, Greenlee, et al., 1949 | Uncertainty assigned by TRC = 0.6 K; TRC |

References

Aldrich Chemical Company Inc., 1990
Aldrich Chemical Company Inc.,
Catalog Handbook of Fine Chemicals, Aldrich Chemical Company, Inc., Milwaukee WI, 1990, 1. [all data]
Van Volkenburgh, Greenlee, et al., 1949
Van Volkenburgh, R.; Greenlee, K.W.; Derfer, J.M.; Boord, C.E.,
A Synthesis of Vinylcyclopropane,
J. Am. Chem. Soc., 1949, 71, 3595. [all data]