Tridecane, 1-bromo-
- Formula: C13H27Br
- Molecular weight: 263.257
- IUPAC Standard InChIKey: BFDNZQUBFCYTIC-UHFFFAOYSA-N
- CAS Registry Number: 765-09-3
- Chemical structure:
View 3d structure (requires JavaScript / HTML 5) - Other names: n-Tridecyl-1-bromide; Tridecyl bromide; 1-Bromotridecane; n-Tridecyl bromide

Phase change data

Data compiled as indicated in comments:
BS - Robert L. Brown and Stephen E. Stein
TRC - Thermodynamics Research Center, NIST Boulder Laboratories, Chris Muzny director
AC - William E. Acree, Jr., James S. Chickos
Quantity | Value | Units | Method | Reference | Comment |
---|---|---|---|---|---|
Tfus | 279.1 | K | N/A | Crowe and Smyth, 1950 | Uncertainty assigned by TRC = 0.3 K; TRC |
Reduced pressure boiling point
Tboil (K) | Pressure (bar) | Reference | Comment |
---|---|---|---|
422.2 | 0.013 | Aldrich Chemical Company Inc., 1990 | BS |
421. | 0.013 | Farchan Laboratories, 1990 | BS |
Enthalpy of vaporization
ΔvapH (kJ/mol) | Temperature (K) | Method | Reference | Comment |
---|---|---|---|---|
64.6 | 440. | A,EST | Stephenson and Malanowski, 1987 | Based on data from 425. to 628. K. See also Li and Rossini, 1961 and Dykyj and Vanko, 1970.; AC |

Van Den Dool and Kratz RI, non-polar column, custom temperature program

Column type | Active phase | I | Reference | Comment |
---|---|---|---|---|
Capillary | DB-1 | 1652. | Peng, 2000 | 15. m/0.53 mm/1. μm, He; Program: 40C(3min) => 8C/min => 200(1min) => 5C/min => 300C(25min) |

Van Den Dool and Kratz RI, polar column, temperature ramp

Column type | Active phase | I | Reference | Comment |
---|---|---|---|---|
Capillary | DB-Wax | 1905. | Peng, 2000 | 15. m/0.53 mm/1. μm, He, 40. C @ 3. min, 5. K/min, 220. C @ 30. min |
Capillary | HP-Wax | 1900. | Peng, 2000 | 15. m/0.53 mm/1. μm, He, 40. C @ 3. min, 5. K/min, 220. C @ 30. min |

Normal alkane RI, non-polar column, isothermal

Column type | Active phase | Temperature (C) | I | Reference | Comment |
---|---|---|---|---|---|
Capillary | Apiezon L | 130. | 1651. | Arruda, Junkes, et al., 2008 |

Normal alkane RI, non-polar column, custom temperature program

Column type | Active phase | I | Reference | Comment |
---|---|---|---|---|
Capillary | OV-1, SE-30, Methyl silicone, SP-2100, OV-101, DB-1, etc. | 1658. | Waggott and Davies, 1984 | Hydrogen; Column length: 50. m; Column diameter: 0.32 mm; Program: not specified |

References

Crowe and Smyth, 1950
Crowe, R.W.; Smyth, C.P.,
Thermal and Dielectric Evidence of Polymorphism in Some Long-Chain n-Alkyl Bromides,
J. Am. Chem. Soc., 1950, 72, 3, 1098, https://doi.org/10.1021/ja01159a011
. [all data]
Aldrich Chemical Company Inc., 1990
Aldrich Chemical Company Inc.,
Catalog Handbook of Fine Chemicals, Aldrich Chemical Company, Inc., Milwaukee WI, 1990, 1. [all data]
Farchan Laboratories, 1990
Farchan Laboratories,
Research Chemicals Catalog, Farchan Laboratories, Gainesville, FL, 1990, 91. [all data]
Stephenson and Malanowski, 1987
Stephenson, Richard M.; Malanowski, Stanislaw,
Handbook of the Thermodynamics of Organic Compounds, 1987, https://doi.org/10.1007/978-94-009-3173-2
. [all data]
Li and Rossini, 1961
Li, J.C.M.; Rossini, F.D.,
Vapor Pressures and Boiling Points of the l-Fluoroalkanes, l-Chloroalkanes, l-Bromoalkanes, and l-Iodoalkanes, C 1 to C 20 .,
J. Chem. Eng. Data, 1961, 6, 2, 268-270, https://doi.org/10.1021/je60010a025
. [all data]
Dykyj and Vanko, 1970
Dykyj, J.; Vanko, A.,
Petrochemica, 1970, 10, 1, 3. [all data]
Peng, 2000
Peng, C.T.,
Prediction of retention indices. V. Influence of electronic effects and column polarity on retention index,
J. Chromatogr. A, 2000, 903, 1-2, 117-143, https://doi.org/10.1016/S0021-9673(00)00901-8
. [all data]
Arruda, Junkes, et al., 2008
Arruda, A.C.S.; Junkes, B. da.S.; Souza, E.S.; Yunes, R.A.; Heizen, V.E.F.,
Semi-Emlirical Topological Index to Predict Properties of Halogenated Aliphatic Compounds,
J. Chemometrics, 2008, 22, 3-4, 186-194, https://doi.org/10.1002/cem.1121
. [all data]
Waggott and Davies, 1984
Waggott, A.; Davies, I.W.,
Identification of organic pollutants using linear temperature programmed retention indices (LTPRIs) - Part II, 1984, retrieved from http://dwi.defra.gov.uk/research/completed-research/reports/dwi0383.pdf. [all data]