Ethene, 1,1'-[oxybis(2,1-ethanediyloxy)]bis-
- Formula: C8H14O3
- Molecular weight: 158.1950
- IUPAC Standard InChIKey: SAMJGBVVQUEMGC-UHFFFAOYSA-N
- CAS Registry Number: 764-99-8
- Chemical structure:
View 3d structure (requires JavaScript / HTML 5) - Other names: Ether, bis[2-(vinyloxy)ethyl]; Bis[2-(vinyloxy)ethyl] ether; Diethylene glycol divinyl ether; Divinylcarbitol; 3,6,9-Trioxaundeca-1,10-diene; Divinyl ether diethylenglykolu; Dvedeg; NSC 6117; 1,1'-[oxybis(ethyleneoxy)]diethylene

Phase change data

Data compiled as indicated in comments:
TRC - Thermodynamics Research Center, NIST Boulder Laboratories, Chris Muzny director
AC - William E. Acree, Jr., James S. Chickos
Quantity | Value | Units | Method | Reference | Comment |
---|---|---|---|---|---|
Tfus | 246.8 | K | N/A | Anonymous, 1954 | Uncertainty assigned by TRC = 0.6 K; TRC |
Enthalpy of vaporization
ΔvapH (kJ/mol) | Temperature (K) | Method | Reference | Comment |
---|---|---|---|---|
50.0 | 351. | A | Stephenson and Malanowski, 1987 | Based on data from 336. to 470. K.; AC |

Reaction thermochemistry data

Data compiled by: Hussein Y. Afeefy, Joel F. Liebman, and Stephen E. Stein
Individual Reactions
By formula: 2H2 + C8H14O3 = C8H18O3
Quantity | Value | Units | Method | Reference | Comment |
---|---|---|---|---|---|
ΔrH° | -224.7 ± 1.8 | kJ/mol | Chyd | Allinger, Glaser, et al., 1981 | liquid phase; solvent: Hexane |

References

Anonymous, 1954
Anonymous, R.,
, Am. Pet. Inst. Res. Proj. 45, Tech. Rep. 13, Ohio State Univ., 1954. [all data]
Stephenson and Malanowski, 1987
Stephenson, Richard M.; Malanowski, Stanislaw,
Handbook of the Thermodynamics of Organic Compounds, 1987, https://doi.org/10.1007/978-94-009-3173-2
. [all data]
Allinger, Glaser, et al., 1981
Allinger, N.L.; Glaser, J.A.; Davis, H.E.,
Heats of hydrogenation of some vinyl ethers and related compounds,
J. Org. Chem., 1981, 46, 658-661. [all data]