5-Undecene, (E)-
- Formula: C11H22
- Molecular weight: 154.2924
- IUPAC Standard InChIKey: NGCRXXLKJAAUQQ-PKNBQFBNSA-N
- CAS Registry Number: 764-97-6
- Chemical structure:
View 3d structure (requires JavaScript / HTML 5) - Stereoisomers:
- Other names: (E)-5-Undecene; trans-5-Undecene; 5-Undecene, trans-

Phase change data

Data compiled as indicated in comments:
BS - Robert L. Brown and Stephen E. Stein
AC - William E. Acree, Jr., James S. Chickos
Reduced pressure boiling point
Tboil (K) | Pressure (bar) | Reference | Comment |
---|---|---|---|
346.2 | 0.013 | Weast and Grasselli, 1989 | BS |
Enthalpy of vaporization
ΔvapH (kJ/mol) | Temperature (K) | Method | Reference | Comment |
---|---|---|---|---|
51.8 | 348. | A | Stephenson and Malanowski, 1987 | Based on data from 333. to 393. K.; AC |

Kovats' RI, non-polar column, isothermal

Column type | Active phase | Temperature (C) | I | Reference | Comment |
---|---|---|---|---|---|
Capillary | Squalane | 100. | 1082. | Heinzen, Soares, et al., 1999 | |
Capillary | OV-101 | 110. | 1090. | Rang, Kuningas, et al., 1987 | He; Column length: 50. m; Column diameter: 0.25 mm |
Capillary | Squalane | 100. | 1082. | Sojak, Hrivnak, et al., 1973 | |
Capillary | Squalane | 115. | 1082. | Sojak, Hrivnak, et al., 1973 | |
Capillary | Squalane | 130. | 1084. | Sojak, Hrivnak, et al., 1973 | |
Capillary | Squalane | 86. | 1082. | Sojak, Hrivnak, et al., 1973 | |
Capillary | Apiezon L | 120. | 1085.2 | Eisen, Orav, et al., 1972 | Column length: 45. m; Column diameter: 0.25 mm |

Kovats' RI, polar column, isothermal

Column type | Active phase | Temperature (C) | I | Reference | Comment |
---|---|---|---|---|---|
Capillary | PEG 4000 | 100. | 1139. | Rang, Orav, et al., 1988 | |
Capillary | PEG 4000 | 110. | 1139. | Rang, Orav, et al., 1988 | |
Capillary | PEG 4000 | 120. | 1140. | Rang, Orav, et al., 1988 | |
Capillary | PEG 4000 | 80. | 1138. | Rang, Orav, et al., 1988 | |
Capillary | PEG-20M | 100. | 1134. | Rang, Orav, et al., 1988 | |
Capillary | PEG-20M | 110. | 1135. | Rang, Orav, et al., 1988 | |
Capillary | PEG-20M | 120. | 1135. | Rang, Orav, et al., 1988 | |
Capillary | PEG-20M | 130. | 1136. | Rang, Orav, et al., 1988 | |
Capillary | PEG-20M | 90. | 1134. | Rang, Orav, et al., 1988 | |
Capillary | Polyethylene Glycol 4000 | 100. | 1138.7 | Eisen, Orav, et al., 1972 | Column length: 80. m; Column diameter: 0.25 mm |
Capillary | Polyethylene Glycol 4000 | 120. | 1139.7 | Eisen, Orav, et al., 1972 | Column length: 80. m; Column diameter: 0.25 mm |
Capillary | Polyethylene Glycol 4000 | 80. | 1137.7 | Eisen, Orav, et al., 1972 | Column length: 80. m; Column diameter: 0.25 mm |
Capillary | PEG 4000 | 100. | 1138.7 | Orav and Eisen, 1972 | Column length: 80. m; Column diameter: 0.25 mm |
Capillary | PEG 4000 | 100. | 1143.4 | Orav and Eisen, 1972 | Column length: 80. m; Column diameter: 0.25 mm |
Capillary | PEG 4000 | 120. | 1139.7 | Orav and Eisen, 1972 | Column length: 80. m; Column diameter: 0.25 mm |
Capillary | PEG 4000 | 120. | 1146.9 | Orav and Eisen, 1972 | Column length: 80. m; Column diameter: 0.25 mm |
Capillary | PEG 4000 | 80. | 1137.7 | Orav and Eisen, 1972 | Column length: 80. m; Column diameter: 0.25 mm |
Capillary | PEG 4000 | 80. | 1142.1 | Orav and Eisen, 1972 | Column length: 80. m; Column diameter: 0.25 mm |

Kovats' RI, polar column, temperature ramp

Column type | Active phase | I | Reference | Comment |
---|---|---|---|---|
Capillary | DB-Wax | 1134. | Umano and Shibamoto, 1987 | He, 40. C @ 10. min, 2. K/min; Column length: 60. m; Column diameter: 0.25 mm; Tend: 200. C |

Normal alkane RI, non-polar column, isothermal

Column type | Active phase | Temperature (C) | I | Reference | Comment |
---|---|---|---|---|---|
Capillary | Squalane | 80. | 1081. | Lehmkuhl, Olbrysch, et al., 1975 | Nitrogen; Column length: 100. m |
Capillary | Squalane | 70. | 1083. | Schomburg, 1966 |

Normal alkane RI, non-polar column, custom temperature program

Column type | Active phase | I | Reference | Comment |
---|---|---|---|---|
Capillary | Polydimethyl siloxane | 1082. | Junkes, Castanho, et al., 2003 | Program: not specified |

Normal alkane RI, polar column, temperature ramp

Column type | Active phase | I | Reference | Comment |
---|---|---|---|---|
Capillary | DB-Wax | 1146. | Chung, Eiserich, et al., 1993 | 60. C @ 4. min, 3. K/min; Column length: 60. m; Column diameter: 0.25 mm; Tend: 220. C |

References

Weast and Grasselli, 1989
CRC Handbook of Data on Organic Compounds, 2nd Editon, Weast,R.C and Grasselli, J.G., ed(s)., CRC Press, Inc., Boca Raton, FL, 1989, 1. [all data]
Stephenson and Malanowski, 1987
Stephenson, Richard M.; Malanowski, Stanislaw,
Handbook of the Thermodynamics of Organic Compounds, 1987, https://doi.org/10.1007/978-94-009-3173-2
. [all data]
Heinzen, Soares, et al., 1999
Heinzen, V.E.F.; Soares, M.F.; Yunes, R.A.,
Semi-empirical topological method for the prediction of the chromatographic retention of cis- and trans-alkene isomers and alkanes,
J. Chromatogr. A, 1999, 849, 2, 495-506, https://doi.org/10.1016/S0021-9673(99)00530-0
. [all data]
Rang, Kuningas, et al., 1987
Rang, S.; Kuningas, K.; Strenze, T.; Orav, A.; Eisen, O.,
Retention and Thermodynamics of Solution of n-Alkenes in OV-101,
J. Chromatogr., 1987, 406, 75-80, https://doi.org/10.1016/S0021-9673(00)94018-4
. [all data]
Sojak, Hrivnak, et al., 1973
Sojak, L.; Hrivnak, J.; Majer, P.; Janak, J.,
Capillary Gas Chromatography of Linear Alkenes on Squalane,
Anal. Chem., 1973, 45, 2, 293-302, https://doi.org/10.1021/ac60324a039
. [all data]
Eisen, Orav, et al., 1972
Eisen, O.; Orav, A.; Rang, S.,
Identifizierung von Normal-Alkenen, Cyclopentenen und -Hexenen mittels Kapillar-Gas-Chromatographie. Identification des alcènes, cyclopentènes et -hexènes à l'aide de la chromatogrpahie en phase gazeuse sur colonne capillaire,
Chromatographia, 1972, 5, 11, 229-239, https://doi.org/10.1007/BF02270600
. [all data]
Rang, Orav, et al., 1988
Rang, S.A.; Orav, A.E.; Kuningas, K.R.; Meister, A.E.; Strense, T.V.; Eisen, O.G.,
Gas-Chromatographic Characteristics of unsaturated hydrocarbons, Academy of Sciences of Estonia SSR, Tallinn, Estonia SSR, 1988, 208. [all data]
Orav and Eisen, 1972
Orav, A.; Eisen, O.,
The retention indexes for alkenes, alkynes and cyclenes on capillary columns,
Izv. Akad. Nauk Est. SSR, Khim. Geol., 1972, 21, 1, 39-47. [all data]
Umano and Shibamoto, 1987
Umano, K.; Shibamoto, T.,
Analysis of headspace volatiles from overheated beef fat,
J. Agric. Food Chem., 1987, 35, 1, 14-18, https://doi.org/10.1021/jf00073a004
. [all data]
Lehmkuhl, Olbrysch, et al., 1975
Lehmkuhl, H.; Olbrysch, O.; Reinehr, D.; Schomburg, G.; Henneberg, D.,
Vergleich der Additionsrichtungen von tert.-Butyl und Isopropylverbindungen des Magnesiums, Aluminiums and Lithiums an 1-Alkene,
Liebigs Ann. Chem., 1975, 1975, 1, 145-159, https://doi.org/10.1002/jlac.197519750114
. [all data]
Schomburg, 1966
Schomburg, G.,
Gaschromatographische Retentionsdaten und Struktur Chemischer Verbindungen. II. Methylverzweigungen und Doppelbindungen in Offenkettigen Kohlenwasserstoffen,
J. Chromatogr., 1966, 23, 1-17, https://doi.org/10.1016/S0021-9673(01)98652-2
. [all data]
Junkes, Castanho, et al., 2003
Junkes, B.S.; Castanho, R.D.M.; Amboni, C.; Yunes, R.A.; Heinzen, V.E.F.,
Semiempirical Topological Index: A Novel Molecular Descriptor for Quantitative Structure-Retention Relationship Studies,
Internet Electronic Journal of Molecular Design, 2003, 2, 1, 33-49. [all data]
Chung, Eiserich, et al., 1993
Chung, T.Y.; Eiserich, J.P.; Shibamoto, T.,
Volatile compounds identified in headspace samples of peanut oil heated under temperatures ranging from 50 to 200 °C,
J. Agric. Food Chem., 1993, 41, 9, 1467-1470, https://doi.org/10.1021/jf00033a022
. [all data]