5-Undecene, (Z)-
- Formula: C11H22
- Molecular weight: 154.2924
- IUPAC Standard InChIKey: NGCRXXLKJAAUQQ-LUAWRHEFSA-N
- CAS Registry Number: 764-96-5
- Chemical structure:
View 3d structure (requires JavaScript / HTML 5) - Stereoisomers:
- Other names: (Z)-5-Undecene; cis-5-Undecene; 5-Undecene, cis-

Phase change data

Data compiled by: William E. Acree, Jr., James S. Chickos
Enthalpy of vaporization
ΔvapH (kJ/mol) | Temperature (K) | Method | Reference | Comment |
---|---|---|---|---|
51.4 | 348. | A | Stephenson and Malanowski, 1987 | Based on data from 333. to 393. K. |

Kovats' RI, non-polar column, isothermal

Column type | Active phase | Temperature (C) | I | Reference | Comment |
---|---|---|---|---|---|
Capillary | Squalane | 100. | 1078. | Heinzen, Soares, et al., 1999 | |
Capillary | OV-101 | 110. | 1090. | Rang, Kuningas, et al., 1987 | He; Column length: 50. m; Column diameter: 0.25 mm |
Capillary | Squalane | 100. | 1078. | Sojak, Hrivnak, et al., 1973 | |
Capillary | Squalane | 115. | 1079. | Sojak, Hrivnak, et al., 1973 | |
Capillary | Squalane | 130. | 1080. | Sojak, Hrivnak, et al., 1973 | |
Capillary | Squalane | 86. | 1078. | Sojak, Hrivnak, et al., 1973 | |
Capillary | Apiezon L | 120. | 1084.8 | Eisen, Orav, et al., 1972 | Column length: 45. m; Column diameter: 0.25 mm |

Kovats' RI, polar column, isothermal

Column type | Active phase | Temperature (C) | I | Reference | Comment |
---|---|---|---|---|---|
Capillary | PEG 4000 | 100. | 1143. | Rang, Orav, et al., 1988 | |
Capillary | PEG 4000 | 110. | 1145. | Rang, Orav, et al., 1988 | |
Capillary | PEG 4000 | 120. | 1147. | Rang, Orav, et al., 1988 | |
Capillary | PEG 4000 | 80. | 1142. | Rang, Orav, et al., 1988 | |
Capillary | PEG-20M | 100. | 1138. | Rang, Orav, et al., 1988 | |
Capillary | PEG-20M | 110. | 1139. | Rang, Orav, et al., 1988 | |
Capillary | PEG-20M | 120. | 1140. | Rang, Orav, et al., 1988 | |
Capillary | PEG-20M | 130. | 1141. | Rang, Orav, et al., 1988 | |
Capillary | PEG-20M | 90. | 1137. | Rang, Orav, et al., 1988 | |
Capillary | Polyethylene Glycol 4000 | 100. | 1143.4 | Eisen, Orav, et al., 1972 | Column length: 80. m; Column diameter: 0.25 mm |
Capillary | Polyethylene Glycol 4000 | 120. | 1146.9 | Eisen, Orav, et al., 1972 | Column length: 80. m; Column diameter: 0.25 mm |
Capillary | Polyethylene Glycol 4000 | 80. | 1142.1 | Eisen, Orav, et al., 1972 | Column length: 80. m; Column diameter: 0.25 mm |

Normal alkane RI, non-polar column, custom temperature program

Column type | Active phase | I | Reference | Comment |
---|---|---|---|---|
Capillary | Polydimethyl siloxane | 1078. | Junkes, Castanho, et al., 2003 | Program: not specified |

References

Stephenson and Malanowski, 1987
Stephenson, Richard M.; Malanowski, Stanislaw,
Handbook of the Thermodynamics of Organic Compounds, 1987, https://doi.org/10.1007/978-94-009-3173-2
. [all data]
Heinzen, Soares, et al., 1999
Heinzen, V.E.F.; Soares, M.F.; Yunes, R.A.,
Semi-empirical topological method for the prediction of the chromatographic retention of cis- and trans-alkene isomers and alkanes,
J. Chromatogr. A, 1999, 849, 2, 495-506, https://doi.org/10.1016/S0021-9673(99)00530-0
. [all data]
Rang, Kuningas, et al., 1987
Rang, S.; Kuningas, K.; Strenze, T.; Orav, A.; Eisen, O.,
Retention and Thermodynamics of Solution of n-Alkenes in OV-101,
J. Chromatogr., 1987, 406, 75-80, https://doi.org/10.1016/S0021-9673(00)94018-4
. [all data]
Sojak, Hrivnak, et al., 1973
Sojak, L.; Hrivnak, J.; Majer, P.; Janak, J.,
Capillary Gas Chromatography of Linear Alkenes on Squalane,
Anal. Chem., 1973, 45, 2, 293-302, https://doi.org/10.1021/ac60324a039
. [all data]
Eisen, Orav, et al., 1972
Eisen, O.; Orav, A.; Rang, S.,
Identifizierung von Normal-Alkenen, Cyclopentenen und -Hexenen mittels Kapillar-Gas-Chromatographie. Identification des alcènes, cyclopentènes et -hexènes à l'aide de la chromatogrpahie en phase gazeuse sur colonne capillaire,
Chromatographia, 1972, 5, 11, 229-239, https://doi.org/10.1007/BF02270600
. [all data]
Rang, Orav, et al., 1988
Rang, S.A.; Orav, A.E.; Kuningas, K.R.; Meister, A.E.; Strense, T.V.; Eisen, O.G.,
Gas-Chromatographic Characteristics of unsaturated hydrocarbons, Academy of Sciences of Estonia SSR, Tallinn, Estonia SSR, 1988, 208. [all data]
Junkes, Castanho, et al., 2003
Junkes, B.S.; Castanho, R.D.M.; Amboni, C.; Yunes, R.A.; Heinzen, V.E.F.,
Semiempirical Topological Index: A Novel Molecular Descriptor for Quantitative Structure-Retention Relationship Studies,
Internet Electronic Journal of Molecular Design, 2003, 2, 1, 33-49. [all data]