Nonanoyl chloride
- Formula: C9H17ClO
- Molecular weight: 176.684
- IUPAC Standard InChIKey: NTQYXUJLILNTFH-UHFFFAOYSA-N
- CAS Registry Number: 764-85-2
- Chemical structure:
View 3d structure (requires JavaScript / HTML 5) - Other names: Pelargonoyl chloride; Nonanoic acid chloride

Phase change data

Data compiled as indicated in comments:
BS - Robert L. Brown and Stephen E. Stein
TRC - Thermodynamics Research Center, NIST Boulder Laboratories, Chris Muzny director
Quantity | Value | Units | Method | Reference | Comment |
---|---|---|---|---|---|
Tboil | 488.5 | K | N/A | Weast and Grasselli, 1989 | BS |
Tboil | 487. | K | N/A | Lee, 1966 | Uncertainty assigned by TRC = 10. K; TRC |
Tboil | 493.15 | K | N/A | Cahours, 1850 | Uncertainty assigned by TRC = 6. K; ~; TRC |
Reduced pressure boiling point
Tboil (K) | Pressure (bar) | Reference | Comment |
---|---|---|---|
382.2 | 0.029 | Aldrich Chemical Company Inc., 1990 | BS |
371.2 | 0.020 | Weast and Grasselli, 1989 | BS |

Van Den Dool and Kratz RI, non-polar column, custom temperature program

Column type | Active phase | I | Reference | Comment |
---|---|---|---|---|
Capillary | VF-5MS | 1215.7 | Tret'yakov, 2007 | 30. m/0.25 mm/0.25 μm, He; Program: Multi-step temperature program; T(initial)=60C; T(final)=270C |

References

Weast and Grasselli, 1989
CRC Handbook of Data on Organic Compounds, 2nd Editon, Weast,R.C and Grasselli, J.G., ed(s)., CRC Press, Inc., Boca Raton, FL, 1989, 1. [all data]
Lee, 1966
Lee, J.B.,
Preparation of Acyl Halides under Very Mild Conditions,
J. Am. Chem. Soc., 1966, 88, 3440-1. [all data]
Cahours, 1850
Cahours, A.,
Researches on Pelargonic Acid,
J. Chem. Soc., 1850, 3, 240. [all data]
Aldrich Chemical Company Inc., 1990
Aldrich Chemical Company Inc.,
Catalog Handbook of Fine Chemicals, Aldrich Chemical Company, Inc., Milwaukee WI, 1990, 1. [all data]
Tret'yakov, 2007
Tret'yakov, K.V.,
Retention Data. NIST Mass Spectrometry Data Center., NIST Mass Spectrometry Data Center, 2007. [all data]