Ethene, 1,1'-[1,2-ethanediylbis(oxy)]bis-
- Formula: C6H10O2
- Molecular weight: 114.1424
- IUPAC Standard InChIKey: ZXHDVRATSGZISC-UHFFFAOYSA-N
- CAS Registry Number: 764-78-3
- Chemical structure:
View 3d structure (requires JavaScript / HTML 5) - Other names: 1,2-Divinyloxyethane

Condensed phase thermochemistry data

Data compiled by: Hussein Y. Afeefy, Joel F. Liebman, and Stephen E. Stein
Quantity | Value | Units | Method | Reference | Comment |
---|---|---|---|---|---|
ΔcH°liquid | -3523. ± 11. | kJ/mol | Ccb | Favorskii and Shostakovskii, 1943 | Corresponding ΔfHºliquid = -267. kJ/mol (simple calculation by NIST; no Washburn corrections) |

References

Favorskii and Shostakovskii, 1943
Favorskii, A.E.; Shostakovskii, M.F.,
Vinyl ethers. I. Synthesis and properties of vinyl ethers,
Zh. Obshch. Kim., 1943, 13, 1-20. [all data]