2,4,6-octatriene
- Formula: C8H12
- Molecular weight: 108.1809
- IUPAC Standard InChIKey: CGMDPTNRMYIZTM-UHFFFAOYSA-N
- CAS Registry Number: 764-75-0
- Chemical structure:
View 3d structure (requires JavaScript / HTML 5) - Species with the same structure:
- Stereoisomers:

Phase change data

Data compiled by: Thermodynamics Research Center, NIST Boulder Laboratories, Chris Muzny director
Quantity | Value | Units | Method | Reference | Comment |
---|---|---|---|---|---|
Tboil | 401. | K | N/A | Farmer, Laroiz, et al., 1927 | Uncertainty assigned by TRC = 7. K |
Quantity | Value | Units | Method | Reference | Comment |
Tfus | 325.7 | K | N/A | Lespieau, Guillemonat, et al., 1933 | Uncertainty assigned by TRC = 2. K |

References

Farmer, Laroiz, et al., 1927
Farmer, E.H.; Laroiz, B.D.; Switz, T.M.; Thorpe, J.F.,
Properties of Conjugated Compounds Part III. The Bearing of Hexatriene Chemistry on the Reactive Forms of Conjugated Hydrocarbons,
J. Chem. Soc., 1927, 1927, 2937-58. [all data]
Lespieau, Guillemonat, et al., 1933
Lespieau, R.; Guillemonat, A.; Urion, E.,
Two Hydrocarbons Which Form Colloidal Polymerization Products,
Kolloid-Z., 1933, 63, 84-7. [all data]