α-Methoxyisobutyronitrile
- Formula: C5H9NO
- Molecular weight: 99.1311
- IUPAC Standard InChIKey: GREBWGAVFUQVPM-UHFFFAOYSA-N
- CAS Registry Number: 76474-09-4
- Chemical structure:
View 3d structure (requires JavaScript / HTML 5) - Permanent link for this species. Use this link for bookmarking this species for future reference.

Gas phase thermochemistry data

Data compiled by: Hussein Y. Afeefy, Joel F. Liebman, and Stephen E. Stein
Quantity | Value | Units | Method | Reference | Comment |
---|---|---|---|---|---|
ΔfH°gas | -125.4 ± 1.8 | kJ/mol | Ccb | Verevkin, Beckhaus, et al., 1995 |

Condensed phase thermochemistry data

Data compiled by: Hussein Y. Afeefy, Joel F. Liebman, and Stephen E. Stein
Quantity | Value | Units | Method | Reference | Comment |
---|---|---|---|---|---|
ΔfH°liquid | -162.80 | kJ/mol | Ccb | Verevkin, Beckhaus, et al., 1995 | |
Quantity | Value | Units | Method | Reference | Comment |
ΔcH°liquid | -3091.0 ± 0.46 | kJ/mol | Ccb | Verevkin, Beckhaus, et al., 1995 |

Phase change data

Data compiled as indicated in comments:
ALS - Hussein Y. Afeefy, Joel F. Liebman, and Stephen E. Stein
AC - William E. Acree, Jr., James S. Chickos
Quantity | Value | Units | Method | Reference | Comment |
---|---|---|---|---|---|
ΔvapH° | 37.41 ± 0.84 | kJ/mol | V | Verevkin, Beckhaus, et al., 1995 | ALS |
ΔvapH° | 37.4 ± 0.8 | kJ/mol | GS | Verevkin, Beckhaus, et al., 1995 | Based on data from 261. to 285. K.; AC |

References

Verevkin, Beckhaus, et al., 1995
Verevkin, S.P.; Beckhaus, H.-D.; Ruchardt, C.,
Geminale substituenteneffekte. Teil 6. Standardbildungsenthalpien von alkylsubstituierten-alkoxynitrilen und α-cyano-carbonsaureestern,
Thermochim. Acta, 1995, 249, 1-11. [all data]