Sodium hydride
- Formula: HNa
- Molecular weight: 23.99771
- IUPAC Standard InChIKey: MPMYQQHEHYDOCL-UHFFFAOYSA-N
- CAS Registry Number: 7646-69-7
- Chemical structure:

Condensed phase thermochemistry data

Quantity | Value | Units | Method | Reference | Comment |
---|---|---|---|---|---|
ΔfH°solid | -56.44 | kJ/mol | Review | Chase, 1998 | Data last reviewed in March, 1963 |
Quantity | Value | Units | Method | Reference | Comment |
S°solid | 40.03 | J/mol*K | Review | Chase, 1998 | Data last reviewed in March, 1963 |
Solid Phase Heat Capacity (Shomate Equation)
Cp° = A + B*t + C*t2 + D*t3 +
E/t2
H° − H°298.15= A*t + B*t2/2 +
C*t3/3 + D*t4/4 − E/t + F − H
S° = A*ln(t) + B*t + C*t2/2 + D*t3/3 −
E/(2*t2) + G
Cp = heat capacity (J/mol*K)
H° = standard enthalpy (kJ/mol)
S° = standard entropy (J/mol*K)
t = temperature (K) / 1000.
View plot Requires a JavaScript / HTML 5 canvas capable browser.
Temperature (K) | 298. to 1500. |
---|---|
A | 22.24729 |
B | 71.68112 |
C | -43.55126 |
D | 9.435674 |
E | -0.321076 |
F | -66.96785 |
G | 45.62610 |
H | -56.44216 |
Reference | Chase, 1998 |
Comment | Data last reviewed in March, 1963 |

Gas phase ion energetics data

Data evaluated as indicated in comments:
HL - Edward P. Hunter and Sharon G. Lias
Data compiled as indicated in comments:
B - John E. Bartmess
Quantity | Value | Units | Method | Reference | Comment |
---|---|---|---|---|---|
Proton affinity (review) | 1095. | kJ/mol | N/A | Hunter and Lias, 1998 | HL |
Quantity | Value | Units | Method | Reference | Comment |
Gas basicity | 1070.6 | kJ/mol | N/A | Hunter and Lias, 1998 | HL |
De-protonation reactions
Na- + =
Quantity | Value | Units | Method | Reference | Comment |
---|---|---|---|---|---|
ΔrH° | 1444.0 ± 2.0 | kJ/mol | D-EA | Patterson, Hotop, et al., 1974 | gas phase; B |
Quantity | Value | Units | Method | Reference | Comment |
ΔrG° | 1423.5 ± 2.4 | kJ/mol | H-TS | Patterson, Hotop, et al., 1974 | gas phase; B |

Gas phase thermochemistry data

Quantity | Value | Units | Method | Reference | Comment |
---|---|---|---|---|---|
ΔfH°gas | 29.701 | kcal/mol | Review | Chase, 1998 | Data last reviewed in March, 1963 |
Quantity | Value | Units | Method | Reference | Comment |
S°gas,1 bar | 45.026 | cal/mol*K | Review | Chase, 1998 | Data last reviewed in March, 1963 |
Gas Phase Heat Capacity (Shomate Equation)
Cp° = A + B*t + C*t2 + D*t3 +
E/t2
H° − H°298.15= A*t + B*t2/2 +
C*t3/3 + D*t4/4 − E/t + F − H
S° = A*ln(t) + B*t + C*t2/2 + D*t3/3 −
E/(2*t2) + G
Cp = heat capacity (cal/mol*K)
H° = standard enthalpy (kcal/mol)
S° = standard entropy (cal/mol*K)
t = temperature (K) / 1000.
View plot Requires a JavaScript / HTML 5 canvas capable browser.
Temperature (K) | 298. to 900. | 900. to 6000. |
---|---|---|
A | 4.441329 | 8.826831 |
B | 10.64390 | 0.299826 |
C | -9.602152 | -0.014660 |
D | 3.261750 | 0.001056 |
E | 0.034890 | -0.344755 |
F | 28.09821 | 26.12359 |
G | 47.82110 | 54.26759 |
H | 29.70010 | 29.70010 |
Reference | Chase, 1998 | Chase, 1998 |
Comment | Data last reviewed in March, 1963 | Data last reviewed in March, 1963 |

Reaction thermochemistry data

Data compiled by: John E. Bartmess
Individual Reactions
Na- + =
Quantity | Value | Units | Method | Reference | Comment |
---|---|---|---|---|---|
ΔrH° | 345.12 ± 0.48 | kcal/mol | D-EA | Patterson, Hotop, et al., 1974 | gas phase |
Quantity | Value | Units | Method | Reference | Comment |
ΔrG° | 340.23 ± 0.58 | kcal/mol | H-TS | Patterson, Hotop, et al., 1974 | gas phase |

Constants of diatomic molecules

Data compiled by: Klaus P. Huber and Gerhard H. Herzberg
Data collected through March, 1977
Symbol | Meaning |
---|---|
State | electronic state and / or symmetry symbol |
Te | minimum electronic energy (cm-1) |
ωe | vibrational constant – first term (cm-1) |
ωexe | vibrational constant – second term (cm-1) |
ωeye | vibrational constant – third term (cm-1) |
Be | rotational constant in equilibrium position (cm-1) |
αe | rotational constant – first term (cm-1) |
γe | rotation-vibration interaction constant (cm-1) |
De | centrifugal distortion constant (cm-1) |
βe | rotational constant – first term, centrifugal force (cm-1) |
re | internuclear distance (Å) |
Trans. | observed transition(s) corresponding to electronic state |
ν00 | position of 0-0 band (units noted in table) |
State | Te | ωe | ωexe | ωeye | Be | αe | γe | De | βe | re | Trans. | ν00 |
---|---|---|---|---|---|---|---|---|---|---|---|---|
Extensive theoretical calculations have been made of X 1Σ+ Cade and Huo, 1967 Sachs, Hinze, et al., 1975 Meyer and Rosmus, 1975 [see also Varshni and Shukla, 1963 Cade, Bader, et al., 1969] and of A 1Σ+, B 1Π, a 3Σ+, b 3Π, c 3Σ+ Sachs, Hinze, et al., 1975; B, a, and c are predicted to be unstable. The calculations of Sachs, Hinze, et al., 1975 include transition moments, band strengths, line strengths, and the farwing broadening of the sodium D line; see also Watson, Stewart, et al., 1976. Additional higher excited states have been computed by Numrich and Truhlar, 1975. | ||||||||||||
b 3Π | (30940) 1 | (419) 1 | (50) 1 | (3.53) 1 | (0.85) 1 | (2.22) 1 | ||||||
A 1Σ+ | 22719 | 310.6 $cZ | 1.696 2 | 2.27E-4 3 | 3.209 | A ↔ X 4 R | 22294.5 Z | |||||
↳missing citation; missing citation; Olsson, 1935; Pankhurst, 1949 | ||||||||||||
X 1Σ+ | 0 | 1172.2 Z | 19.72 5 | 0.160 | 4.9012 | 0.1353 6 | 3.32E-4 6 | 1.8874 |

References

Chase, 1998
Chase, M.W., Jr.,
NIST-JANAF Themochemical Tables, Fourth Edition,
J. Phys. Chem. Ref. Data, Monograph 9, 1998, 1-1951. [all data]
Hunter and Lias, 1998
Hunter, E.P.; Lias, S.G.,
Evaluated Gas Phase Basicities and Proton Affinities of Molecules: An Update,
J. Phys. Chem. Ref. Data, 1998, 27, 3, 413-656, https://doi.org/10.1063/1.556018
. [all data]
Patterson, Hotop, et al., 1974
Patterson, T.A.; Hotop, H.; Kasdan, A.; Norcross, D.W.; Lineberger, W.C.,
Resonances in Alkali Negative-Ion Photodetachment and Electron Affinities of the Corresponding Neutrals,
Phys. Rev. Lett., 1974, 32, 5, 189, https://doi.org/10.1103/PhysRevLett.32.189
. [all data]