O2C(CH2)4CO2 dianion
- Formula: C6H8O4-2
- Molecular weight: 144.1264
- CAS Registry Number: 764-65-8

Gas phase ion energetics data

Data compiled by: John E. Bartmess
Electron affinity of neutral species
EAneutral (eV) | Method | Reference | Comment |
---|---|---|---|
1.010 ± 0.090 | LPES | Ding, Wang, et al., 1998 |
Protonation reactions
C6H8O4-2 + = C6H9O4-2
By formula: C6H8O4-2 + H+ = C6H9O4-2
Quantity | Value | Units | Method | Reference | Comment |
---|---|---|---|---|---|
ΔrH° | 403.3 ± 3.7 | kcal/mol | D-EA | Ding, Wang, et al., 1998 | gas phase |

Ion clustering data

Data compiled as indicated in comments:
B - John E. Bartmess
M - Michael M. Meot-Ner (Mautner) and Sharon G. Lias
Clustering reactions
C6H8O4-2 + = C6H9O4-2
By formula: C6H8O4-2 + H+ = C6H9O4-2
Quantity | Value | Units | Method | Reference | Comment |
---|---|---|---|---|---|
ΔrH° | 403.3 ± 3.7 | kcal/mol | D-EA | Ding, Wang, et al., 1998 | gas phase; B |
By formula: C6H8O4-2 + H2O = (C6H8O4-2 • H2O)
Quantity | Value | Units | Method | Reference | Comment |
---|---|---|---|---|---|
ΔrH° | 7.1 ± 4.2 | kcal/mol | N/A | Ding, Wang, et al., 1998 | gas phase; Affinity is EA difference from next lower solvated ion.; B |
(C6H8O4-2 • ) +
= (C6H8O4-2 • 2
)
By formula: (C6H8O4-2 • H2O) + H2O = (C6H8O4-2 • 2H2O)
Quantity | Value | Units | Method | Reference | Comment |
---|---|---|---|---|---|
ΔrH° | 13.4 ± 4.2 | kcal/mol | N/A | Ding, Wang, et al., 1998 | gas phase; Affinity is EA difference from next lower solvated ion.; B |
(C6H8O4-2 • 2) +
= (C6H8O4-2 • 3
)
By formula: (C6H8O4-2 • 2H2O) + H2O = (C6H8O4-2 • 3H2O)
Bond type: Hydrogen bond (negative ion to hydride)
Quantity | Value | Units | Method | Reference | Comment |
---|---|---|---|---|---|
ΔrG° | 8.40 ± 0.30 | kcal/mol | TDAs | Blades, Klassen, et al., 1995 | gas phase; B,M |
(C6H8O4-2 • 3) +
= (C6H8O4-2 • 4
)
By formula: (C6H8O4-2 • 3H2O) + H2O = (C6H8O4-2 • 4H2O)
Bond type: Hydrogen bond (negative ion to hydride)
Quantity | Value | Units | Method | Reference | Comment |
---|---|---|---|---|---|
ΔrG° | 7.50 ± 0.30 | kcal/mol | TDAs | Blades, Klassen, et al., 1995 | gas phase; B,M |
(C6H8O4-2 • 4) +
= (C6H8O4-2 • 5
)
By formula: (C6H8O4-2 • 4H2O) + H2O = (C6H8O4-2 • 5H2O)
Bond type: Hydrogen bond (negative ion to hydride)
Quantity | Value | Units | Method | Reference | Comment |
---|---|---|---|---|---|
ΔrG° | 6.40 ± 0.30 | kcal/mol | TDAs | Blades, Klassen, et al., 1995 | gas phase; B,M |
(C6H8O4-2 • 5) +
= (C6H8O4-2 • 6
)
By formula: (C6H8O4-2 • 5H2O) + H2O = (C6H8O4-2 • 6H2O)
Bond type: Hydrogen bond (negative ion to hydride)
Quantity | Value | Units | Method | Reference | Comment |
---|---|---|---|---|---|
ΔrG° | 5.80 ± 0.30 | kcal/mol | TDAs | Blades, Klassen, et al., 1995 | gas phase; B,M |

Reaction thermochemistry data

Data compiled as indicated in comments:
B - John E. Bartmess
M - Michael M. Meot-Ner (Mautner) and Sharon G. Lias

Individual Reactions

(C6H8O4-2 • 2Water) + Water = (C6H8O4-2 • 3Water)

By formula: (C6H8O4-2 • 2H2O) + H2O = (C6H8O4-2 • 3H2O)

Bond type: Hydrogen bond (negative ion to hydride)

Quantity Value Units Method Reference Comment
Δr35.1 ± 1.3kJ/molTDAsBlades, Klassen, et al., 1995gas phase; B,M

(C6H8O4-2 • 3Water) + Water = (C6H8O4-2 • 4Water)

By formula: (C6H8O4-2 • 3H2O) + H2O = (C6H8O4-2 • 4H2O)

Bond type: Hydrogen bond (negative ion to hydride)

Quantity Value Units Method Reference Comment
Δr31.4 ± 1.3kJ/molTDAsBlades, Klassen, et al., 1995gas phase; B,M

(C6H8O4-2 • 4Water) + Water = (C6H8O4-2 • 5Water)

By formula: (C6H8O4-2 • 4H2O) + H2O = (C6H8O4-2 • 5H2O)

Bond type: Hydrogen bond (negative ion to hydride)

Quantity Value Units Method Reference Comment
Δr26.8 ± 1.3kJ/molTDAsBlades, Klassen, et al., 1995gas phase; B,M

(C6H8O4-2 • 5Water) + Water = (C6H8O4-2 • 6Water)

By formula: (C6H8O4-2 • 5H2O) + H2O = (C6H8O4-2 • 6H2O)

Bond type: Hydrogen bond (negative ion to hydride)

Quantity Value Units Method Reference Comment
Δr24.3 ± 1.3kJ/molTDAsBlades, Klassen, et al., 1995gas phase; B,M

(C6H8O4-2 • Water) + Water = (C6H8O4-2 • 2Water)

By formula: (C6H8O4-2 • H2O) + H2O = (C6H8O4-2 • 2H2O)

Quantity Value Units Method Reference Comment
Δr56. ± 18.kJ/molN/ADing, Wang, et al., 1998gas phase; Affinity is EA difference from next lower solvated ion.; B

C6H8O4-2 + Water = (C6H8O4-2 • Water)

By formula: C6H8O4-2 + H2O = (C6H8O4-2 • H2O)

Quantity Value Units Method Reference Comment
Δr30. ± 18.kJ/molN/ADing, Wang, et al., 1998gas phase; Affinity is EA difference from next lower solvated ion.; B

C6H8O4-2 + Hydrogen cation = C6H9O4-2

By formula: C6H8O4-2 + H+ = C6H9O4-2

Quantity Value Units Method Reference Comment
Δr1687. ± 15.kJ/molD-EADing, Wang, et al., 1998gas phase; B

References

Ding, Wang, et al., 1998
Ding, C.F.; Wang, X.B.; Wang, L.S.,
Photoelectron spectroscopy of doubly charged anions: Intramolecular Coulomb repulsion and solvent stabilization,
J. Phys. Chem. A, 1998, 102, 45, 8633-8636, https://doi.org/10.1021/jp982698x
. [all data]
Blades, Klassen, et al., 1995
Blades, A.T.; Klassen, J.S.; Kebarle, P.,
Free Energies of Hydration in the Gas Phase on the Anions of Some Oxo Acids of C, N, S, P, Cl and I,
J. Am. Chem. Soc., 1995, 117, 42, 10563, https://doi.org/10.1021/ja00147a019
. [all data]