O2C(CH2)5CO2 dianion
- Formula: C7H10O4-2
- Molecular weight: 158.1530
- CAS Registry Number: 764-54-5

Gas phase ion energetics data

Data compiled by: John E. Bartmess
Electron affinity of neutral species
EAneutral (eV) | Method | Reference | Comment |
---|---|---|---|
1.340 ± 0.090 | LPES | Ding, Wang, et al., 1998 |
Protonation reactions
C7H10O4-2 + = C7H11O4-2
By formula: C7H10O4-2 + H+ = C7H11O4-2
Quantity | Value | Units | Method | Reference | Comment |
---|---|---|---|---|---|
ΔrH° | 1656. ± 15. | kJ/mol | D-EA | Ding, Wang, et al., 1998 | gas phase |

Ion clustering data

Data compiled as indicated in comments:
B - John E. Bartmess
M - Michael M. Meot-Ner (Mautner) and Sharon G. Lias
Clustering reactions
C7H10O4-2 + = C7H11O4-2
By formula: C7H10O4-2 + H+ = C7H11O4-2
Quantity | Value | Units | Method | Reference | Comment |
---|---|---|---|---|---|
ΔrH° | 1656. ± 15. | kJ/mol | D-EA | Ding, Wang, et al., 1998 | gas phase; B |
By formula: C7H10O4-2 + H2O = (C7H10O4-2 • H2O)
Quantity | Value | Units | Method | Reference | Comment |
---|---|---|---|---|---|
ΔrH° | 25. ± 18. | kJ/mol | N/A | Ding, Wang, et al., 1998 | gas phase; Affinity is EA difference from next lower solvated ion.; B |
(C7H10O4-2 • ) +
= (C7H10O4-2 • 2
)
By formula: (C7H10O4-2 • H2O) + H2O = (C7H10O4-2 • 2H2O)
Quantity | Value | Units | Method | Reference | Comment |
---|---|---|---|---|---|
ΔrH° | 56. ± 18. | kJ/mol | N/A | Ding, Wang, et al., 1998 | gas phase; Affinity is EA difference from next lower solvated ion.; B |
(C7H10O4-2 • 2) +
= (C7H10O4-2 • 3
)
By formula: (C7H10O4-2 • 2H2O) + H2O = (C7H10O4-2 • 3H2O)
Bond type: Hydrogen bond (negative ion to hydride)
Quantity | Value | Units | Method | Reference | Comment |
---|---|---|---|---|---|
ΔrG° | 33.5 ± 1.3 | kJ/mol | TDAs | Blades, Klassen, et al., 1995 | gas phase; B,M |
(C7H10O4-2 • 3) +
= (C7H10O4-2 • 4
)
By formula: (C7H10O4-2 • 3H2O) + H2O = (C7H10O4-2 • 4H2O)
Bond type: Hydrogen bond (negative ion to hydride)
Quantity | Value | Units | Method | Reference | Comment |
---|---|---|---|---|---|
ΔrG° | 30.1 ± 1.3 | kJ/mol | TDAs | Blades, Klassen, et al., 1995 | gas phase; B,M |
(C7H10O4-2 • 4) +
= (C7H10O4-2 • 5
)
By formula: (C7H10O4-2 • 4H2O) + H2O = (C7H10O4-2 • 5H2O)
Bond type: Hydrogen bond (negative ion to hydride)
Quantity | Value | Units | Method | Reference | Comment |
---|---|---|---|---|---|
ΔrG° | 25.9 ± 1.3 | kJ/mol | TDAs | Blades, Klassen, et al., 1995 | gas phase; B,M |
(C7H10O4-2 • 5) +
= (C7H10O4-2 • 6
)
By formula: (C7H10O4-2 • 5H2O) + H2O = (C7H10O4-2 • 6H2O)
Bond type: Hydrogen bond (negative ion to hydride)
Quantity | Value | Units | Method | Reference | Comment |
---|---|---|---|---|---|
ΔrG° | 23.0 ± 1.3 | kJ/mol | TDAs | Blades, Klassen, et al., 1995 | gas phase; B,M |

References

Ding, Wang, et al., 1998
Ding, C.F.; Wang, X.B.; Wang, L.S.,
Photoelectron spectroscopy of doubly charged anions: Intramolecular Coulomb repulsion and solvent stabilization,
J. Phys. Chem. A, 1998, 102, 45, 8633-8636, https://doi.org/10.1021/jp982698x
. [all data]
Blades, Klassen, et al., 1995
Blades, A.T.; Klassen, J.S.; Kebarle, P.,
Free Energies of Hydration in the Gas Phase on the Anions of Some Oxo Acids of C, N, S, P, Cl and I,
J. Am. Chem. Soc., 1995, 117, 42, 10563, https://doi.org/10.1021/ja00147a019
. [all data]