Heptachlor
- Formula: C10H5Cl7
- Molecular weight: 373.318
- IUPAC Standard InChIKey: FRCCEHPWNOQAEU-UHFFFAOYSA-N
- CAS Registry Number: 76-44-8
- Chemical structure:
View 3d structure (requires JavaScript / HTML 5) - Species with the same structure:
- Other names: 4,7-Methano-1H-indene, 1,4,5,6,7,8,8-heptachloro-3a,4,7,7a-tetrahydro-; 4,7-Methanoindene, 1,4,5,6,7,8,8-heptachloro-3a,4,7,7a-tetrahydro-; Aahepta; Agroceres; E 3314; ENT 15,152; GPKh; Hepta; Heptachlorane; Rhodiachlor; Velsicol 104; 3-Chlorochlordene; 1,4,5,6,7,8,8-heptachloro-3a,4,7,7a-tetrahydro-4,7-methanoindene; Dicyclopentadiene, 3,4,5,6,7,8,8a-heptachloro-; Eptacloro; H-34; Heptachloor; Heptachlorotetrahydro-4,7-methanoindene; Heptagran; Heptamul; NCI-C00180; Technical heptachlor; Velsicol heptachlor; 1(3a),4,5,6,7,8,8-Heptachloro-3a(1),4,7,7a-tetrahydro-4,7-methanoindene; 1,4,5,6,7,10,10-Heptachloro-4,7,8,9-tetrahydro-4,7-endo-methyleneindene; 1,4,5,6,7,10,10-Heptachloro-4,7,8,9-tetrahydro-4,7-methyleneindene; 1,4,5,6,7,8,8-Eptacloro-3a,4,7,7a-tetraidro-4,7-endo-metano-indene; 1,4,5,6,7,8,8-Heptachloor-3a,4,7,7a-tetrahydro-4,7-endo-methano-indeen; 1,4,5,6,7,8,8-Heptachlor-3a,4,7,7,7a-tetrahydro-4,7-endo-methano-inden; 1,4,5,6,7,8,8-Heptachloro-3a,4,7,7,7a-tetrahydro-4,7-methylene indene; 1,4,5,6,7,8,8-Heptachloro-3a,4,7,7a-tetrahydro-4,7-endo-methanoindene; 3a,4,5,6,7,8,8-Heptachloro-3a,4,7,7a-tetrahydro-4,7-methanoindene; Drinox H-34; H-60; 3,4,5,6,7,8,8a-Heptachlorodicyclopentadiene; 1,4,5,6,7,8,8a-Heptachloro-3a,4,7,7a-tetrahydro-4,7-methanoindane; Heptox; Latka 104; Rcra waste number P059; Heptachlore; Arbinex 30TN; NSC 8930; 1,4,5,6,7,8,8-Heptachloro-3a,4,7,7a-tetrahydro-4,7-endomethanoindene (heptachlor)

Phase change data

Data compiled as indicated in comments:
TRC - Thermodynamics Research Center, NIST Boulder Laboratories, Chris Muzny director
AC - William E. Acree, Jr., James S. Chickos
Quantity | Value | Units | Method | Reference | Comment |
---|---|---|---|---|---|
Tfus | 366. | K | N/A | Plato, 1972 | Crystal phase 1 phase; Uncertainty assigned by TRC = 1. K; TRC |
Tfus | 369.0 | K | N/A | Plato and Glasgow, 1969 | Uncertainty assigned by TRC = 0.2 K; TRC |
Enthalpy of vaporization
ΔvapH (kJ/mol) | Temperature (K) | Method | Reference | Comment |
---|---|---|---|---|
76.5 | 398. | GC | Hinckley, Bidleman, et al., 1990 | Based on data from 343. to 453. K.; AC |
Enthalpy of fusion
ΔfusH (kJ/mol) | Temperature (K) | Method | Reference | Comment |
---|---|---|---|---|
20.72 | 362.2 | TGA,DSC | Rodante, Vecchio, et al., 2000 | AC |
2.09 | 371. | DSC | Ksia«807»azczak and Nagata, 1995 | AC |

References

Plato, 1972
Plato, C.,
DSC as a general method for determining purity and heat of fusion of high-purity organic chemicals,
Anal. Chem., 1972, 44, 1531. [all data]
Plato and Glasgow, 1969
Plato, C.; Glasgow, A.R., Jr.,
Differential scanning calorimetry as a general method for determining the purity and heat of fusion of high-purity organic chemicals. Application to 95 compounds,
Anal. Chem., 1969, 41, 2, 330, https://doi.org/10.1021/ac60271a041
. [all data]
Hinckley, Bidleman, et al., 1990
Hinckley, Daniel A.; Bidleman, Terry F.; Foreman, William T.; Tuschall, Jack R.,
Determination of vapor pressures for nonpolar and semipolar organic compounds from gas chromatograhic retention data,
J. Chem. Eng. Data, 1990, 35, 3, 232-237, https://doi.org/10.1021/je00061a003
. [all data]
Rodante, Vecchio, et al., 2000
Rodante, F.; Vecchio, S.; Catalani, G.; Guidotti, M.,
Journal of Thermal Analysis and Calorimetry, 2000, 60, 2, 605-622, https://doi.org/10.1023/A:1010159424733
. [all data]
Ksia«807»azczak and Nagata, 1995
Ksia«807»azczak, A.; Nagata, I.,
Crystal-plastic and plastic-liquid phase transitions, and purity determination,
Thermochimica Acta, 1995, 254, 31-39, https://doi.org/10.1016/0040-6031(94)02032-J
. [all data]